{"text_format":"1","workbook":"xlsx","n_sheets":8,"sheets":["Introduction","N2O4","NH3","NO","Fe(SCN)","Modifiable","Unprotected","Notes"],"not_rendered":{"charts":12,"images":1,"macros":1,"external_links":0,"defined_names":51,"comments":0,"pivot_tables":0},"unopened":[],"bounds":{"document_bytes":16777216,"sheet_cells":100000,"rows_first":2000,"rows_last":500,"rows_between":2000,"halvings":0,"cell_chars":16384,"cell_head_chars":4096},"cells_cut":0,"cells_raw":0,"read":"whole","date_system":"1900"}

{"sheet":"Introduction","index":0,"n_rows":1,"n_cols":3,"rows_kept":1,"cut":false,"hidden":false,"merged":[]}
["¾",null,"EQUILIBRATOR"]

{"sheet":"N2O4","index":1,"n_rows":116,"n_cols":30,"rows_kept":116,"cut":false,"hidden":false,"merged":[]}
[]
[{"$f":"IF($Y$5=1,\"Pressure:\",\"Volume:\")","v":"Pressure:"},null,1,{"$f":"IF($Y$5=1,\"atm\",\"L\")","v":"atm"},null,null,null,null,null,null,null,null,null,null,null,null,null,null,null,null,null,null,null,null,2,"Celsius","A=",-3.54]
["Temperature:",null,{"$f":"Y9-273*IF($Y$2=1,1,0)","v":404},{"$f":"IF(Y2=1,\"C\",\"K\")","v":"K"},null,null,null,null,null,null,null,null,null,null,null,null,null,null,null,null,null,null,null,null,null,"Kelvin"]
["Reaction:",1,"N2O4",null,2,"NO2",null,null,null,null,null,null,null,null,null,null,null,null,null,null,null,null,null,null,{"$f":"(VLOOKUP(AB11,Z13:AD116,3)+(VLOOKUP(AB11,Z13:AD116,5)-VLOOKUP(AB11,Z13:AD116,3))*(AB11-VLOOKUP(AB11,Z13:AC116,1))/(VLOOKUP(AB11,Z13:AC116,4)-VLOOKUP(AB11,Z13:AC116,1)))/AB11/10000","v":1.4849208955195112E-3},"Equilibrium Sensitivity","B=",-6374.8]
["initial (moles):",null,2,null,null,1,null,"Units:",null,null,null,null,null,null,null,null,null,null,null,null,null,null,null,null,1,"Constant Pressure","C=",4.6567999999999996]
[{"$f":"IF($Y$7=1,\"initial (atm):\",\"initial (M):\")","v":"initial (atm):"},null,{"$f":"IF($Y$5=1,$C$2*C5/SUM($C$5:$F$5),0.08205821*$Y$9*C5/$C$2)/(0.08205821*$Y$9)^($Y$7-1)","v":0.66666666666666663},null,null,{"$f":"IF($Y$5=1,$C$2*F5/SUM($C$5:$F$5),0.08205821*$Y$9*F5/$C$2)/(0.08205821*$Y$9)^($Y$7-1)","v":0.33333333333333331},null,{"$f":"IF($Y$7=1,\"Qpi = \",\"Qci = \")","v":"Qpi = "},{"$f":"IF(C6=0,\"∞\",(F6)^$E$4/(C6)^$B$4)","v":0.16666666666666666},null,"Initial Reaction Quotient",null,null,null,null,null,null,null,null,null,null,null,null,null,null,"Constant Volume","D=",-1.3828E-2]
["change (moles):",null,{"$f":"MIN(F5/E4)-(Y11/29999)*(MIN(C5/B4)+MIN(F5/E4))","v":-1.919913997133238},null,null,{"$f":"-E4*C7/B4","v":3.8398279942664759},null,"x =",{"$f":"F7/E4","v":1.919913997133238},"mol","Extent of Reaction",null,null,null,null,null,null,null,null,null,null,null,null,null,1,"Atmospheres","E=",7.1936E-6]
[{"$f":"IF(ABS(I9/I10-1)<Y4,\"equilibrium (moles):\",\"equilibrating ... (moles):\")","v":"equilibrating ... (moles):"},null,{"$f":"C7+C5","v":8.008600286676204E-2},null,null,{"$f":"F7+F5","v":4.8398279942664759},null,null,null,null,null,null,null,null,null,null,null,null,null,null,null,null,null,null,null,"Molarity","F=",-1.9517999999999998E-9]
[{"$f":"IF(ABS(I9/I10-1)<Y4,IF($Y$7=1,\"equilibrium (atm):\",\"equilibrium (M)\"),IF($Y$7=1,\"equilibrating ... (atm):\",\"equilibrating…(M)\"))","v":"equilibrating ... (atm):"},null,{"$f":"IF($Y$5=1,$C$2*(C5+C7)/SUM($C$5:$F$5,$C$7:$F$7),(C5+C7)*0.08205821*$Y$9/$C$2)/(0.08205821*$Y$9)^($Y$7-1)","v":1.6277927401460064E-2},null,null,{"$f":"IF($Y$5=1,$C$2*(F5+F7)/SUM($C$5:$F$5,$C$7:$F$7),(F5+F7)*0.08205821*$Y$9/$C$2)/(0.08205821*$Y$9)^($Y$7-1)","v":0.98372207259854005},null,{"$f":"IF($Y$7=1,\"Qp = \",\"Qc = \")","v":"Qp = "},{"$f":"(F9)^E4/(C9)^B4","v":59.449160341553537},null,"Reaction Quotient",{"$f":"I9/I10-1","v":-1.9558306262905667E-3},null,null,null,null,null,null,null,null,null,null,null,null,404,"Temperature (k)","lnK =",{"$f":"AB2+AB4/Y9+AB5*LN(Y9)+AB6*Y9+AB7*Y9^2+AB8*Y9^3","v":4.0870792450222035}]
[null,null,null,null,null,null,null,{"$f":"IF($Y$7=1,\"Kp = \",\"Kc = \")","v":"Kp = "},{"$f":"IF($Y$7=1,$AB$11,$AB$11*(0.08205821*$Y$9)^(B4-E4))","v":59.565660684996487},null,"Equilibrium Constant",null,null,null,null,null,null,null,null,null,null,null,null,null,null,null,null," (LnK = A + B/T +ClnK + DT + ET^2 + FT^3)"]
[{"$f":"IF(ABS($I$9/$I$10-1)<Y4,\"\",IF($I$9>$I$10,\"¬\",\"®\"))","v":"®"},{"$f":"IF(ABS(I9/I10-1)<Y4,\"Equilibrium!\",IF(I9>I10,\"Too far.\",\"Not far enough…\"))","v":"Not far enough…"},null,null,null,{"$f":"IF(ABS($I$9/$I$10-1)<Y4,\"\",IF($I$9>$I$10,\"¬\",\"®\"))","v":"®"},null,"G =",{"$f":"0.00831451*$Y$9*I9*(LN(I9/I10)-1)/I10","v":-3.3590556111419803},"kJ","Gibb's Free Energy",null,null,null,null,null,null,null,null,null,null,null,null,null,29038,"Slider Position (1 - 29998)","Kp =",{"$f":"EXP(AB9)","v":59.565660684996487}]
[null,null,null,null,null,null,null,"ΔG =",{"$f":"0.00831451*$Y$9*LN(I9/I10)","v":-6.5761894681879533E-3},"kJ/mol",null,null,null,null,null,null,null,null,null,null,null,null,null,null,"x","Qp","G"]
[null,null,null,null,null,null,null,null,null,null,null,null,null,null,null,null,null,null,null,null,null,null,null,null,{"$f":"-F5/E4","v":-0.5},0,0,{"$f":"(Z14-Z13)/(Y14-Y13)","v":1.6000016000016016E-3},{"$f":"Z14","v":4.0000040000040072E-6},{"$f":"AB14","v":6.4001024016384321E-3}]
[null,null,null,null,null,null,null,null,null,null,null,null,null,null,null,null,null,null,null,null,null,null,null,null,{"$f":"($C$5/$B$4+$F$5/$E$4)/1000+Y13","v":-0.4975},{"$f":"IF($Y$5=1,$C$2/($F$5+$C$5+($E$4-$B$4)*Y14),(0.08205821*$Y$9)/$C$2)^($E$4-$B$4)*($F$5+$E$4*Y14)^$E$4/($C$5-$B$4*Y14)^$B$4","v":4.0000040000040072E-6},{"$f":"0.00831451*$Y$9*Z14*(LN(Z14/$AB$11)-1)/$AB$11","v":-3.9511609812016652E-6},{"$f":"(Z15-Z13)/(Y15-Y13)","v":6.4001024016384321E-3},{"$f":"Z15","v":6.400102401638438E-5},{"$f":"AB15","v":1.7601777777795397E-2}]
[null,null,null,null,null,null,null,null,null,null,null,null,null,null,null,null,null,null,null,null,null,null,null,null,{"$f":"(MIN($C$5/$B$4)+$F$5/$E$4)/250+Y13","v":-0.49},6.400102401638438E-5,-5.3212687893589684E-5,{"$f":"(Z16-Z14)/(Y16-Y14)","v":1.7601777777795397E-2},4.0004000400040076E-4,3.8415980802151459E-2]
[null,null,null,null,null,null,null,null,null,null,null,null,null,null,null,null,null,null,null,null,null,null,null,null,{"$f":"(MIN($C$5/$B$4)+$F$5/$E$4)/100+Y13","v":-0.47499999999999998},4.0004000400040076E-4,-2.9126360151895926E-4,3.8415980802151459E-2,1.6006402561024441E-3,6.4064058292527357E-2]
[null,null,null,null,null,null,null,null,null,null,null,null,null,null,null,null,null,null,null,null,null,null,null,null,{"$f":"(MIN($C$5/$B$4)+$F$5/$E$4)/100+Y16","v":-0.44999999999999996},1.6006402561024441E-3,-1.040244149922731E-3,6.4064058292527357E-2,3.603242918626771E-3,9.6192323083079456E-2]
[null,null,null,null,null,null,null,null,null,null,null,null,null,null,null,null,null,null,null,null,null,null,null,null,{"$f":"(MIN($C$5/$B$4)+$F$5/$E$4)/100+Y17","v":-0.42499999999999993},3.603242918626771E-3,-2.1768410553353653E-3,9.6192323083079456E-2,6.4102564102564213E-3,0.12843639476029686]
[null,null,null,null,null,null,null,null,null,null,null,null,null,null,null,null,null,null,null,null,null,null,null,null,-0.39999999999999991,{"$f":"IF($Y$5=1,$C$2/($F$5+$C$5+($E$4-$B$4)*Y19),(0.08205821*$Y$9)/$C$2)^($E$4-$B$4)*($F$5+$E$4*Y19)^$E$4/($C$5-$B$4*Y19)^$B$4","v":6.4102564102564213E-3},-3.6644106447542746E-3,0.12843639476029686,1.0025062656641621E-2,0.16083541776034771]
[null,null,null,null,null,null,null,null,null,null,null,null,null,null,null,null,null,null,null,null,null,null,null,null,-0.37499999999999989,1.0025062656641621E-2,-5.4779941473215004E-3,0.16083541776034771,1.4452027298273815E-2,0.19342900513266909]
[null,null,null,null,null,null,null,null,null,null,null,null,null,null,null,null,null,null,null,null,null,null,null,null,-0.34999999999999987,1.4452027298273815E-2,-7.5989413342219076E-3,0.19342900513266909,1.9696512913275083E-2,0.22625736063677884]
[null,null,null,null,null,null,null,null,null,null,null,null,null,null,null,null,null,null,null,null,null,null,null,null,-0.32499999999999984,1.9696512913275083E-2,-1.0012623614900558E-2,0.22625736063677884,2.5764895330112766E-2,0.25936140420047354]
[null,null,null,null,null,null,null,null,null,null,null,null,null,null,null,null,null,null,null,null,null,null,null,null,-0.29999999999999982,2.5764895330112766E-2,-1.2707234919172226E-2,0.25936140420047354,3.2664583123298771E-2,0.29278290147855413]
[null,null,null,null,null,null,null,null,null,null,null,null,null,null,null,null,null,null,null,null,null,null,null,null,-0.2749999999999998,3.2664583123298771E-2,-1.567308128083585E-2,0.29278290147855413,4.0404040404040477E-2,0.32656459828916318]
[null,null,null,null,null,null,null,null,null,null,null,null,null,null,null,null,null,null,null,null,null,null,null,null,-0.24999999999999981,4.0404040404040477E-2,-1.8902124302132534E-2,0.32656459828916318,4.8992813037756926E-2,0.3607503607503606]
[null,null,null,null,null,null,null,null,null,null,null,null,null,null,null,null,null,null,null,null,null,null,null,null,-0.22499999999999981,4.8992813037756926E-2,-2.2387670229958339E-2,0.3607503607503606,5.8441558441558503E-2,0.395385321993312]
[null,null,null,null,null,null,null,null,null,null,null,null,null,null,null,null,null,null,null,null,null,null,null,null,-0.19999999999999982,5.8441558441558503E-2,-2.6124148843201769E-2,0.395385321993312,6.8762079137422522E-2,0.43051603639118985]
[null,null,null,null,null,null,null,null,null,null,null,null,null,null,null,null,null,null,null,null,null,null,null,null,-0.17499999999999982,6.8762079137422522E-2,-3.0106950933919956E-2,0.43051603639118985,7.996736026111799E-2,0.46619064231548973]
["Developed by Prof. Douglas A. Vander Griend, Calvin College, Grand Rapids, MI",null,null,null,null,null,null,null,null,null,null,null,null,null,null,null,null,null,null,null,null,null,null,null,-0.14999999999999983,7.996736026111799E-2,-3.4332305777982165E-2,0.46619064231548973,9.2071611253197003E-2,0.50245903451491614]
[null,null,null,null,null,null,null,null,null,null,null,null,null,null,null,null,null,null,null,null,null,null,null,null,-0.12499999999999983,9.2071611253197003E-2,-3.8797186935356422E-2,0.50245903451491614,0.10509031198686379,0.53937304730759905]
[null,null,null,null,null,null,null,null,null,null,null,null,null,null,null,null,null,null,null,null,null,null,null,null,-9.9999999999999839E-2,0.10509031198686379,-4.3499238766943331E-2,0.53937304730759905,0.11904026361857695,0.57698664988653758]
[null,null,null,null,null,null,null,null,null,null,null,null,null,null,null,null,null,null,null,null,null,null,null,null,-7.4999999999999845E-2,0.11904026361857695,-4.8436718525838293E-2,0.57698664988653758,0.13393964448119067,0.61535615516243924]
[null,null,null,null,null,null,null,null,null,null,null,null,null,null,null,null,null,null,null,null,null,null,null,null,-4.9999999999999843E-2,0.13393964448119067,-5.3608450450272141E-2,0.61535615516243924,0.14980807137669891,0.65454044370952202]
[null,null,null,null,null,null,null,null,null,null,null,null,null,null,null,null,null,null,null,null,null,null,null,null,-2.4999999999999842E-2,0.14980807137669891,-5.901378931642192E-2,0.65454044370952202,0.16666666666666677,0.69460120454050756]
[null,null,null,null,null,null,null,null,null,null,null,null,null,null,null,null,null,null,null,null,null,null,null,null,1.5959455978986625E-16,0.16666666666666677,-6.4652591606751492E-2,0.69460120454050756,0.18453813160372429,0.73560319461958845]
[null,null,null,null,null,null,null,null,null,null,null,null,null,null,null,null,null,null,null,null,null,null,null,null,2.5000000000000161E-2,0.18453813160372429,-7.0525192933882944E-2,0.73560319461958845,0.20344682639764619,0.77761451922949865]
[null,null,null,null,null,null,null,null,null,null,null,null,null,null,null,null,null,null,null,null,null,null,null,null,5.0000000000000162E-2,0.20344682639764619,-7.6632390704376954E-2,0.77761451922949865,0.22341885756519922,0.82070693554453333]
[null,null,null,null,null,null,null,null,null,null,null,null,null,null,null,null,null,null,null,null,null,null,null,null,7.5000000000000164E-2,0.22341885756519922,{"$f":"0.00831451*$Y$9*Z38*(LN(Z38/$AB$11)-1)/$AB$11","v":-8.2975431257049606E-2},0.82070693554453333,0.24448217317487286,0.86495618202935332]
[null,null,null,null,null,null,null,null,null,null,null,null,null,null,null,null,null,null,null,null,null,null,null,null,0.10000000000000017,0.24448217317487286,-8.9556000896091656E-2,0.86495618202935332,0.26666666666666689,0.91044233658834539]
[null,null,null,null,null,null,null,null,null,null,null,null,null,null,null,null,null,null,null,null,null,null,null,null,0.12500000000000017,0.26666666666666689,-9.6376220379745595E-2,0.91044233658834539,0.29000429000429012,0.95725020673785655]
[null,null,null,null,null,null,null,null,null,null,null,null,null,null,null,null,null,null,null,null,null,null,null,null,0.15000000000000016,0.29000429000429012,-0.10343864253376772,0.95725020673785655,0.3145291770035597,1.005469755469758]
[null,null,null,null,null,null,null,null,null,null,null,null,null,null,null,null,null,null,null,null,null,null,null,null,0.17500000000000016,0.3145291770035597,-0.11074625274439771,1.005469755469758,0.34027777777777801,1.0551965669273891]
[null,null,null,null,null,null,null,null,null,null,null,null,null,null,null,null,null,null,null,null,null,null,null,null,0.20000000000000015,0.34027777777777801,-0.11830247215441748,1.0551965669273891,0.36728900534992914,1.1065323565323577]
[null,null,null,null,null,null,null,null,null,null,null,null,null,null,null,null,null,null,null,null,null,null,null,null,0.22500000000000014,0.36728900534992914,-0.12611116344265819,1.1065323565323577,0.39560439560439592,1.159585530793209]
[null,null,null,null,null,null,null,null,null,null,null,null,null,null,null,null,null,null,null,null,null,null,null,null,0.25000000000000017,0.39560439560439592,-0.1341766391153125,1.159585530793209,0.42526828188958965,1.2144718027070955]
[null,null,null,null,null,null,null,null,null,null,null,null,null,null,null,null,null,null,null,null,null,null,null,null,0.27500000000000019,{"$f":"IF($Y$5=1,$C$2/($F$5+$C$5+($E$4-$B$4)*Y46),(0.08205821*$Y$9)/$C$2)^($E$4-$B$4)*($F$5+$E$4*Y46)^$E$4/($C$5-$B$4*Y46)^$B$4","v":0.42526828188958965},-0.14250367227911026,1.2144718027070955,0.45632798573975075,1.2713148694464549]
[null,null,null,null,null,null,null,null,null,null,null,null,null,null,null,null,null,null,null,null,null,null,null,null,0.30000000000000021,0.45632798573975075,-0.15109750990369999,1.2713148694464549,0.48883402536191245,1.3302471599223142]
[null,null,null,null,null,null,null,null,null,null,null,null,null,null,null,null,null,null,null,null,null,null,null,null,0.32500000000000023,0.48883402536191245,-0.1599638886149119,1.3302471599223142,0.52284034373586652,1.3914106608529262]
[null,null,null,null,null,null,null,null,null,null,null,null,null,null,null,null,null,null,null,null,null,null,null,null,0.35000000000000026,0.52284034373586652,-0.16910905309316607,1.3914106608529262,0.55840455840455883,1.4549578311650322]
[null,null,null,null,null,null,null,null,null,null,null,null,null,null,null,null,null,null,null,null,null,null,null,null,0.37500000000000028,0.55840455840455883,-0.17853977718310307,1.4549578311650322,0.5955882352941182,1.5210526159431246]
[null,null,null,null,null,null,null,null,null,null,null,null,null,null,null,null,null,null,null,null,null,null,null,null,0.4000000000000003,0.5955882352941182,-0.18826338785243338,1.5210526159431246,0.63445718920171512,1.5898715727525268]
[null,null,null,null,null,null,null,null,null,null,null,null,null,null,null,null,null,null,null,null,null,null,null,null,0.42500000000000032,0.63445718920171512,-0.19828779217079348,1.5898715727525268,0.6750818139317446,1.6616051250351711]
[null,null,null,null,null,null,null,null,null,null,null,null,null,null,null,null,null,null,null,null,null,null,null,null,0.45000000000000034,0.6750818139317446,-0.20862150751381056,1.6616051250351711,0.71753744545347375,1.7364589594603657]
[null,null,null,null,null,null,null,null,null,null,null,null,null,null,null,null,null,null,null,null,null,null,null,null,0.47500000000000037,0.71753744545347375,-0.2192736952343351,1.7364589594603657,0.76190476190476286,1.814655586663199]
[null,null,null,null,null,null,null,null,null,null,null,null,null,null,null,null,null,null,null,null,null,null,null,null,0.50000000000000033,0.76190476190476286,-0.230254198082668,1.814655586663199,0.80827022478663368,1.8964360877911006]
[null,null,null,null,null,null,null,null,null,null,null,null,null,null,null,null,null,null,null,null,null,null,null,null,0.52500000000000036,0.80827022478663368,-0.24157358170135784,1.8964360877911006,0.85672656629431798,1.9820620727865395]
[null,null,null,null,null,null,null,null,null,null,null,null,null,null,null,null,null,null,null,null,null,null,null,null,0.55000000000000038,0.85672656629431798,-0.253243180568688,1.9820620727865395,0.90737332842596075,2.0718178804628655]
[null,null,null,null,null,null,null,null,null,null,null,null,null,null,null,null,null,null,null,null,null,null,null,null,0.5750000000000004,0.90737332842596075,-0.26527514881923175,2.0718178804628655,0.96031746031746135,2.1660130553052519]
[null,null,null,null,null,null,null,null,null,null,null,null,null,null,null,null,null,null,null,null,null,null,null,null,0.60000000000000042,0.96031746031746135,-0.27768251643098291,2.1660130553052519,1.0156739811912234,2.2649851416974642]
[null,null,null,null,null,null,null,null,null,null,null,null,null,null,null,null,null,null,null,null,null,null,null,null,0.62500000000000044,1.0156739811912234,-0.29047925133779989,2.2649851416974642,1.0735667174023347,2.3691028431245953]
[null,null,null,null,null,null,null,null,null,null,null,null,null,null,null,null,null,null,null,null,null,null,null,null,0.65000000000000047,1.0735667174023347,-0.30368032810472351,2.3691028431245953,1.1341291233474533,2.4787696020572869]
[null,null,null,null,null,null,null,null,null,null,null,null,null,null,null,null,null,null,null,null,null,null,null,null,0.67500000000000049,1.1341291233474533,-0.31730180389386448,2.4787696020572869,1.1975051975051991,2.5944276659631815]
[null,null,null,null,null,null,null,null,null,null,null,null,null,null,null,null,null,null,null,null,null,null,null,null,0.70000000000000051,1.1975051975051991,-0.33136090255203449,2.5944276659631815,1.2638505066456125,2.7165627165627027]
[null,null,null,null,null,null,null,null,null,null,null,null,null,null,null,null,null,null,null,null,null,null,null,null,0.72500000000000053,1.2638505066456125,-0.34587610777052685,2.7165627165627027,1.3333333333333344,2.8457091534778352]
[null,null,null,null,null,null,null,null,null,null,null,null,null,null,null,null,null,null,null,null,null,null,null,null,0.75000000000000056,1.3333333333333344,-0.36086726640528655,2.8457091534778352,1.4061359643195044,2.9824561403508971]
[null,null,null,null,null,null,null,null,null,null,null,null,null,null,null,null,null,null,null,null,null,null,null,null,0.77500000000000058,1.4061359643195044,-0.3763557032055912,2.9824561403508971,1.4824561403508794,3.1274545420065554]
[null,null,null,null,null,null,null,null,null,null,null,null,null,null,null,null,null,null,null,null,null,null,null,null,0.8000000000000006,1.4824561403508794,-0.39236434838536843,3.1274545420065554,1.5625086914198323,3.2814249061388536]
[null,null,null,null,null,null,null,null,null,null,null,null,null,null,null,null,null,null,null,null,null,null,null,null,0.82500000000000062,1.5625086914198323,-0.4089178796883704,3.2814249061388536,1.6465273856578222,3.4451666733955091]
[null,null,null,null,null,null,null,null,null,null,null,null,null,null,null,null,null,null,null,null,null,null,null,null,0.85000000000000064,1.6465273856578222,-0.4260428808525577,3.4451666733955091,1.7347670250896079,3.6195688369601622]
[null,null,null,null,null,null,null,null,null,null,null,null,null,null,null,null,null,null,null,null,null,null,null,null,0.87500000000000067,1.7347670250896079,-0.44376801867746962,3.6195688369601622,1.8275058275058305,3.8056223185308067]
[null,null,null,null,null,null,null,null,null,null,null,null,null,null,null,null,null,null,null,null,null,null,null,null,0.90000000000000069,1.8275058275058305,-0.462124241249882,3.8056223185308067,1.9250481410161484,4.0044343841812111]
[null,null,null,null,null,null,null,null,null,null,null,null,null,null,null,null,null,null,null,null,null,null,null,null,0.92500000000000071,1.9250481410161484,-0.48114500029842761,4.0044343841812111,2.0277275467148912,4.2172454938357138]
[null,null,null,null,null,null,null,null,null,null,null,null,null,null,null,null,null,null,null,null,null,null,null,null,0.95000000000000073,2.0277275467148912,-0.50086650114027831,4.2172454938357138,2.1359104157079343,4.4454490657022356]
[null,null,null,null,null,null,null,null,null,null,null,null,null,null,null,null,null,null,null,null,null,null,null,null,0.97500000000000075,2.1359104157079343,-0.52132798426866611,4.4454490657022356,2.2500000000000027,4.6906147468383699]
[null,null,null,null,null,null,null,null,null,null,null,null,null,null,null,null,null,null,null,null,null,null,null,null,1.0000000000000007,2.2500000000000027,-0.54257204332900233,4.6906147468383699,2.3704411530498519,4.9545159194282196]
[null,null,null,null,null,null,null,null,null,null,null,null,null,null,null,null,null,null,null,null,null,null,null,null,1.0250000000000006,2.3704411530498519,-0.5646449850684383,4.9545159194282196,2.4977257959714128,5.2391623477246361]
[null,null,null,null,null,null,null,null,null,null,null,null,null,null,null,null,null,null,null,null,null,null,null,null,1.0500000000000005,2.4977257959714128,-0.58759723784979401,5.2391623477246361,2.6323992704360828,5.5468390941219265]
[null,null,null,null,null,null,null,null,null,null,null,null,null,null,null,null,null,null,null,null,null,null,null,null,1.0750000000000004,{"$f":"IF($Y$5=1,$C$2/($F$5+$C$5+($E$4-$B$4)*Y78),(0.08205821*$Y$9)/$C$2)^($E$4-$B$4)*($F$5+$E$4*Y78)^$E$4/($C$5-$B$4*Y78)^$B$4","v":2.6323992704360828},-0.61148381653443384,5.5468390941219265,{"$f":"Z79","v":2.7750677506775081},{"$f":"AB79","v":5.8801531194169279}]
[null,null,null,null,null,null,null,null,null,null,null,null,null,null,null,null,null,null,null,null,null,null,null,null,1.1000000000000003,2.7750677506775081,-0.63636485300823731,{"$f":"(Z80-Z78)/(Y80-Y78)","v":5.8801531194169279},2.9264069264069281,6.2420893521479615]
[null,null,null,null,null,null,null,null,null,null,null,null,null,null,null,null,null,null,null,null,null,null,null,null,1.1250000000000002,2.9264069264069281,-0.66230620341121083,6.2420893521479615,3.0871722182849051,6.6360784923659084]
[null,null,null,null,null,null,null,null,null,null,null,null,null,null,null,null,null,null,null,null,null,null,null,null,1.1500000000000001,3.0871722182849051,-0.68938014531142111,6.6360784923659084,3.2582108510252223,7.0660794438257195]
[null,null,null,null,null,null,null,null,null,null,null,null,null,null,null,null,null,null,null,null,null,null,null,null,{"$f":"(MIN($C$5/$B$4)+$F$5/$E$4)/100+Y81","v":1.175},3.2582108510252223,-0.71766618073548805,7.0660794438257195,3.4404761904761898,7.5366800972661352]
[null,null,null,null,null,null,null,null,null,null,null,null,null,null,null,null,null,null,null,null,null,null,null,null,1.2,3.4404761904761898,-0.74725196425513718,7.5366800972661352,3.6350448558885278,8.0532212885153971]
[null,null,null,null,null,null,null,null,null,null,null,null,null,null,null,null,null,null,null,null,null,null,null,null,1.2249999999999999,3.6350448558885278,-0.77823437939131124,8.0532212885153971,3.8431372549019582,8.6219502304851172]
[null,null,null,null,null,null,null,null,null,null,null,null,null,null,null,null,null,null,null,null,null,null,null,null,1.2499999999999998,3.8431372549019582,-0.81072079163786259,8.6219502304851172,4.0661423674127821,9.2502117125920051]
[null,null,null,null,null,null,null,null,null,null,null,null,null,null,null,null,null,null,null,null,null,null,null,null,1.2749999999999997,4.0661423674127821,-0.84483051268822207,9.2502117125920051,4.3056478405315568,9.9466880831294446]
[null,null,null,null,null,null,null,null,null,null,null,null,null,null,null,null,null,null,null,null,null,null,null,null,1.2999999999999996,4.3056478405315568,-0.88069651830864659,9.9466880831294446,4.5634767715692526,10.721702782649045]
[null,null,null,null,null,null,null,null,null,null,null,null,null,null,null,null,null,null,null,null,null,null,null,null,1.3249999999999995,4.5634767715692526,-0.9184674721771654,10.721702782649045,4.8417329796640072,11.587607425757676]
[null,null,null,null,null,null,null,null,null,null,null,null,null,null,null,null,null,null,null,null,null,null,null,null,1.3499999999999994,4.8417329796640072,-0.95831012046123654,11.587607425757676,5.1428571428571344,12.559279800659082]
[null,null,null,null,null,null,null,null,null,null,null,null,null,null,null,null,null,null,null,null,null,null,null,null,1.3749999999999993,5.1428571428571344,-1.0004121376643267,12.559279800659082,5.4696969696969591,13.654770677615153]
[null,null,null,null,null,null,null,null,null,null,null,null,null,null,null,null,null,null,null,null,null,null,null,null,1.3999999999999992,5.4696969696969591,-1.044985524259459,13.654770677615153,5.8255956767378896,14.896152536601939]
[null,null,null,null,null,null,null,null,null,null,null,null,null,null,null,null,null,null,null,null,null,null,null,null,1.4249999999999992,5.8255956767378896,-1.0922706820186101,14.896152536601939,6.2145045965270533,16.310645656516169]
[null,null,null,null,null,null,null,null,null,null,null,null,null,null,null,null,null,null,null,null,null,null,null,null,1.4499999999999991,6.2145045965270533,-1.1425413251903935,16.310645656516169,6.6411279595636952,17.932130291680767]
[null,null,null,null,null,null,null,null,null,null,null,null,null,null,null,null,null,null,null,null,null,null,null,null,1.474999999999999,6.6411279595636952,-1.1961104264953393,17.932130291680767,7.1111111111110885,19.803204112011485]
[null,null,null,null,null,null,null,null,null,null,null,null,null,null,null,null,null,null,null,null,null,null,null,null,1.4999999999999989,7.1111111111110885,-1.2533374481776878,19.803204112011485,7.6312881651642659,21.978021978021889]
[null,null,null,null,null,null,null,null,null,null,null,null,null,null,null,null,null,null,null,null,null,null,null,null,1.5249999999999988,7.6312881651642659,-1.3146371717467,21.978021978021889,8.2100122100121791,24.526277841040542]
[null,null,null,null,null,null,null,null,null,null,null,null,null,null,null,null,null,null,null,null,null,null,null,null,1.5499999999999987,8.2100122100121791,-1.3804905160730685,24.526277841040542,8.8576020572162886,27.538886234538246]
[null,null,null,null,null,null,null,null,null,null,null,null,null,null,null,null,null,null,null,null,null,null,null,null,1.5749999999999986,8.8576020572162886,-1.4514578192674363,27.538886234538246,9.5869565217390864,31.13624714396153]
[null,null,null,null,null,null,null,null,null,null,null,null,null,null,null,null,null,null,null,null,null,null,null,null,1.5999999999999985,9.5869565217390864,-1.5281951436992209,31.13624714396153,10.41441441441436,35.480531623588853]
[null,null,null,null,null,null,null,null,null,null,null,null,null,null,null,null,null,null,null,null,null,null,null,null,1.6249999999999984,10.41441441441436,-1.6114742134558671,35.480531623588853,11.360983102918523,40.794393735569798]
[null,null,null,null,null,null,null,null,null,null,null,null,null,null,null,null,null,null,null,null,null,null,null,null,1.6499999999999984,11.360983102918523,-1.7022065292254593,40.794393735569798,12.454134101192842,47.390267019641918]
[null,null,null,null,null,null,null,null,null,null,null,null,null,null,null,null,null,null,null,null,null,null,null,null,1.6749999999999983,12.454134101192842,{"$f":"0.00831451*$Y$9*Z102*(LN(Z102/$AB$11)-1)/$AB$11","v":-1.8014718341603924},47.390267019641918,13.73049645390061,55.717702776525634]
[null,null,null,null,null,null,null,null,null,null,null,null,null,null,null,null,null,null,null,null,null,null,null,null,1.6999999999999982,13.73049645390061,-1.9105499651097062,55.717702776525634,15.240019240019114,66.442702500932313]
[null,null,null,null,null,null,null,null,null,null,null,null,null,null,null,null,null,null,null,null,null,null,null,null,1.7249999999999981,15.240019240019114,-2.0309521009597225,66.442702500932313,17.052631578947214,80.586468021021645]
[null,null,null,null,null,null,null,null,null,null,null,null,null,null,null,null,null,null,null,null,null,null,null,null,1.749999999999998,17.052631578947214,-2.1644397319435527,80.586468021021645,19.269342641070182,99.78070175438404]
[null,null,null,null,null,null,null,null,null,null,null,null,null,null,null,null,null,null,null,null,null,null,null,null,1.7749999999999979,19.269342641070182,-2.3130000845667924,99.78070175438404,22.041666666666398,126.76710720819702]
[null,null,null,null,null,null,null,null,null,null,null,null,null,null,null,null,null,null,null,null,null,null,null,null,1.7999999999999978,22.041666666666398,-2.4786953296929246,126.76710720819702,25.60769800148001,166.45189003435996]
[null,null,null,null,null,null,null,null,null,null,null,null,null,null,null,null,null,null,null,null,null,null,null,null,1.8249999999999977,25.60769800148001,-2.6631607257146328,166.45189003435996,30.364261168384367,228.35886048320543]
[null,null,null,null,null,null,null,null,null,null,null,null,null,null,null,null,null,null,null,null,null,null,null,null,1.8499999999999976,30.364261168384367,-2.8661024018703141,228.35886048320543,37.02564102564024,333.12293989759485]
[null,null,null,null,null,null,null,null,null,null,null,null,null,null,null,null,null,null,null,null,null,null,null,null,1.8749999999999976,{"$f":"IF($Y$5=1,$C$2/($F$5+$C$5+($E$4-$B$4)*Y110),(0.08205821*$Y$9)/$C$2)^($E$4-$B$4)*($F$5+$E$4*Y110)^$E$4/($C$5-$B$4*Y110)^$B$4","v":37.02564102564024},-3.0807369061588816,333.12293989759485,47.020408163264051,533.12508134840243]
[null,null,null,null,null,null,null,null,null,null,null,null,null,null,null,null,null,null,null,null,null,null,null,null,1.8999999999999975,47.020408163264051,-3.2787001965185216,533.12508134840243,63.68189509306027,999.79385693663505]
[null,null,null,null,null,null,null,null,null,null,null,null,null,null,null,null,null,null,null,null,null,null,null,null,1.9249999999999974,63.68189509306027,-3.3512202523696497,999.79385693663505,97.010101010095624,2666.4626006509188]
[null,null,null,null,null,null,null,null,null,null,null,null,null,null,null,null,null,null,null,null,null,null,null,null,1.9499999999999973,97.010101010095624,-2.802418374630419,2666.4626006509188,197.00502512560573,9999.7975749473244]
[null,null,null,null,null,null,null,null,null,null,null,null,null,null,null,null,null,null,null,null,null,null,null,null,1.9749999999999972,197.00502512560573,2.1791526813125857,9999.7975749473244,497.0020040080156,79999.798894414838]
[null,null,null,null,null,null,null,null,null,null,null,null,null,null,null,null,null,null,null,null,null,null,null,null,{"$f":"MIN($C$5/$B$4)-(MIN($C$5/$B$4)+$F$5/$E$4)/250","v":1.99},497.0020040080156,31.432955377636901,79999.798894414838,1997.0005002501675,199999.79949895194]
[null,null,null,null,null,null,null,null,null,null,null,null,null,null,null,null,null,null,null,null,null,null,null,null,{"$f":"MIN($C$5/$B$4)-(MIN($C$5/$B$4)+$F$5/$E$4)/1000","v":1.9975000000000001},1997.0005002501675,282.92778237789963,{"$f":"(Z116-Z115)/(Y116-Y115)","v":199999.79949895194},1,1]

{"sheet":"NH3","index":2,"n_rows":116,"n_cols":31,"rows_kept":116,"cut":false,"hidden":false,"merged":[]}
[]
[{"$f":"IF($AB$5=1,\"Pressure:\",\"Volume:\")","v":"Pressure:"},null,3,{"$f":"IF($AB$5=1,IF($AB$5=1,\"atm\",\"bar\"),\"L\")","v":"atm"},null,null,null,null,null,null,null,null,null,null,null,null,null,null,null,null,null,null,null,null,null,null,null,1,"Celsius","A=",6.8400999999999996]
["Temperature:",null,{"$f":"$AB$9-273*IF($AB$2=1,1,0)","v":184},{"$f":"IF(AB2=1,\"C\",\"K\")","v":"C"},null,null,null,null,null,null,null,null,null,null,null,null,null,null,null,null,null,null,null,null,null,null,null,null,"Kelvin"]
["Reaction:",1,"N2","+",3,"H2",null,2,"NH3",null,null,null,null,null,null,null,null,null,null,null,null,null,null,null,null,null,null,null,null,"B=",9496.4]
["initial (moles):",null,2,null,null,3,null,null,0,null,"Units:",null,null,null,null,null,null,null,null,null,null,null,null,null,null,null,null,1,"Constant Pressure","C=",-4.2138999999999998]
[{"$f":"IF($AB$7=1,\"initial (atm):\",\"initial (M):\")","v":"initial (atm):"},null,{"$f":"IF($AB$5=1,$C$2*C5/SUM($C$5:$I$5),0.08205821*$AB$9*C5/$C$2)/(0.08205821*$AB$9)^($AB$7-1)","v":1.2},null,null,{"$f":"IF($AB$5=1,$C$2*F5/SUM($C$5:$I$5),0.08205821*$AB$9*F5/$C$2)/(0.08205821*$AB$9)^($AB$7-1)","v":1.8},null,null,{"$f":"IF($AB$5=1,$C$2*I5/SUM($C$5:$I$5),0.08205821*$AB$9*I5/$C$2)/(0.08205821*$AB$9)^($AB$7-1)","v":0},null,{"$f":"IF($AB$7=1,\"Qpi = \",\"Qci = \")","v":"Qpi = "},{"$f":"IF(C5*F5=0,\"∞\",(I6)^$H$4/(F6)^$E$4/(C6)^$B$4)","v":0},null,"Initial Reaction Quotient",null,null,null,null,null,null,null,null,null,null,null,null,null,null,"Constant Volume","D=",-6.6952000000000001E-3]
["change (moles):",null,{"$f":"MIN(I5/H4)-(AB11/29999)*(MIN(C5/B4,F5/E4)+MIN(I5/H4))","v":-0.60062002066735554},null,null,{"$f":"E4*C7/B4","v":-1.8018600620020666},null,null,{"$f":"-H4*C7/B4","v":1.2012400413347111},null,"x =",{"$f":"I7/H4","v":0.60062002066735554},"mol","Extent of Reaction",null,null,null,null,null,null,null,null,null,null,null,null,null,1,"Atmospheres","E=",6.7811000000000002E-6]
[{"$f":"IF(ABS(L9/L10-1)<0.001,\"equilibrium (moles):\",\"equilibrating ... (moles):\")","v":"equilibrating ... (moles):"},null,{"$f":"C7+C5","v":1.3993799793326445},null,null,{"$f":"F7+F5","v":1.1981399379979334},null,null,{"$f":"I7+I5","v":1.2012400413347111},null,null,null,null,null,null,null,null,null,null,null,null,null,null,null,null,null,null,null,"Molarity","F=",-2.1891999999999998E-9]
[{"$f":"IF(ABS(L9/L10-1)<0.001,IF($AB$7=1,\"equilibrium (atm):\",\"equilibrium (M)\"),IF($AB$7=1,\"equilibrating ... (atm):\",\"equilibrating…(M)\"))","v":"equilibrating ... (atm):"},null,{"$f":"IF($AB$5=1,$C$2*(C5+C7)/SUM($C$5:$I$5,$C$7:$I$7),(C5+C7)*0.08205821*$AB$9/$C$2)/(0.08205821*$AB$9)^($AB$7-1)","v":1.1051343026878084},null,null,{"$f":"IF($AB$5=1,$C$2*(F5+F7)/SUM($C$5:$I$5,$C$7:$I$7),(F5+F7)*0.08205821*$AB$9/$C$2)/(0.08205821*$AB$9)^($AB$7-1)","v":0.9462087241902789},null,null,{"$f":"IF($AB$5=1,$C$2*(I5+I7)/SUM($C$5:$I$5,$C$7:$I$7),(I5+I7)*0.08205821*$AB$9/$C$2)/(0.08205821*$AB$9)^($AB$7-1)","v":0.94865697312191211},null,{"$f":"IF($AB$7=1,\"Qp = \",\"Qc = \")","v":"Qp = "},{"$f":"(I9)^H4/(C9)^B4/(F9)^E4","v":0.96126361351039191},null,"Reaction Quotient",null,null,null,null,null,null,null,null,null,null,null,null,null,457,"Temperature (k)","lnK =",{"$f":"AE2+AE4/AB9+AE5*LN(AB9)+AE6*AB9+AE7*AB9^2+AE8*AB9^3","v":-4.1261067493136988E-2}]
[null,null,null,null,null,null,null,null,null,null,{"$f":"IF($AB$7=1,\"Kp = \",\"Kc = \")","v":"Kp = "},{"$f":"IF($AB$7=1,$AE$11,$AE$11*(0.08205821*$AB$9)^(E4+B4-H4))","v":0.9595785824693277},null,"Equilibrium Constant",null,null,null,null,null,null,null,null,null,null,null,null,null,null,null,null," (LnK = A + B/T +ClnK + DT + ET^2 + FT^3)"]
[{"$f":"IF(ABS($L$9/$L$10-1)<0.001,\"\",IF($L$9>$L$10,\"¬\",\"®\"))","v":"¬"},null,{"$f":"IF(ABS(L9/L10-1)<0.001,\"Equilibrium!\",IF(L9>L10,\"Too far.\",\"Not far enough…\"))","v":"Too far."},null,null,null,null,null,{"$f":"IF(ABS($L$9/$L$10-1)<0.001,\"\",IF($L$9>$L$10,\"¬\",\"®\"))","v":"¬"},null,"G =",{"$f":"0.00831451*$AB$9*L9*(LN(L9/L10)-1)/L10","v":-3.7997252150455112},"kJ","Gibb's Free Energy",null,null,null,null,null,null,null,null,null,null,null,null,null,18018,"Slider Position (1 - 9999)","Kp =",{"$f":"EXP(AE9)","v":0.9595785824693277}]
[null,null,null,null,null,null,null,null,null,null,"ΔG =",{"$f":"0.00831451*$AB$9*LN(L9/L10)","v":6.6665199842248337E-3},"kJ/mol",null,null,null,null,null,null,null,null,null,null,null,null,null,null,null,"x","Qp","G"]
[null,null,null,null,null,null,null,null,null,null,null,null,null,null,null,null,null,null,null,null,null,null,null,null,null,null,null,null,{"$f":"-I5/H4","v":0},0,0]
[null,null,null,null,null,null,null,null,null,null,null,null,null,null,null,null,null,null,null,null,null,null,null,null,null,null,null,null,{"$f":"(MIN($C$5/$B$4,$F$5/$E$4)+$I$5/$H$4)/1000+AC13","v":1E-3},{"$f":"IF($AB$5=1,$C$2/($I$5+$F$5+$C$5+($H$4-$E$4-$B$4)*AC14),(0.08205821*$AB$9)/$C$2)^($H$4-$E$4-$B$4)*($I$5+$H$4*AC14)^$H$4/($C$5-$B$4*AC14)^$B$4/($F$5-$E$4*AC14)^$E$4","v":2.0631792556524571E-7},{"$f":"0.00831451*$AB$9*AD14*(LN(AD14/$AE$11)-1)/$AE$11","v":-1.3359669997343386E-5}]
[null,null,null,null,null,null,null,null,null,null,null,null,null,null,null,null,null,null,null,null,null,null,null,null,null,null,null,null,{"$f":"(MIN($C$5/$B$4,$F$5/$E$4)+$I$5/$H$4)/250+AC13","v":4.0000000000000001E-3},3.3280075395850813E-6,-1.7885310698895473E-4]
[null,null,null,null,null,null,null,null,null,null,null,null,null,null,null,null,null,null,null,null,null,null,null,null,null,null,null,null,{"$f":"(MIN($C$5/$B$4,$F$5/$E$4)+$I$5/$H$4)/100+AC13","v":0.01},2.1142373610310233E-5,-9.8143992103004885E-4]
[null,null,null,null,null,null,null,null,null,null,null,null,null,null,null,null,null,null,null,null,null,null,null,null,null,null,null,null,{"$f":"(MIN($C$5/$B$4,$F$5/$E$4)+$I$5/$H$4)/100+AC16","v":0.02},8.6922787414278697E-5,-3.5483966183138399E-3]
[null,null,null,null,null,null,null,null,null,null,null,null,null,null,null,null,null,null,null,null,null,null,null,null,null,null,null,null,{"$f":"(MIN($C$5/$B$4,$F$5/$E$4)+$I$5/$H$4)/100+AC17","v":0.03},2.0107991642778501E-4,-7.5407766363034083E-3]
[null,null,null,null,null,null,null,null,null,null,null,null,null,null,null,null,null,null,null,null,null,null,null,null,null,null,null,null,0.04,3.676496318692086E-4,-1.2908892698970066E-2]
[null,null,null,null,null,null,null,null,null,null,null,null,null,null,null,null,null,null,null,null,null,null,null,null,null,null,null,null,0.05,5.9099044481861359E-4,-1.9640001523966933E-2]
[null,null,null,null,null,null,null,null,null,null,null,null,null,null,null,null,null,null,null,null,null,null,null,null,null,null,null,null,6.0000000000000005E-2,8.7581135540335767E-4,-2.7741117069878234E-2]
[null,null,null,null,null,null,null,null,null,null,null,null,null,null,null,null,null,null,null,null,null,null,null,null,null,null,null,null,7.0000000000000007E-2,1.2272023595122012E-3,-3.7232043827307493E-2]
[null,null,null,null,null,null,null,null,null,null,null,null,null,null,null,null,null,null,null,null,null,null,null,null,null,null,null,null,0.08,1.6506678942106894E-3,-4.8141907912625674E-2]
[null,null,null,null,null,null,null,null,null,null,null,null,null,null,null,null,null,null,null,null,null,null,null,null,null,null,null,null,0.09,2.1521635359152765E-3,-6.0507218694152841E-2]
[null,null,null,null,null,null,null,null,null,null,null,null,null,null,null,null,null,null,null,null,null,null,null,null,null,null,null,null,9.9999999999999992E-2,2.7381363024998858E-3,-7.437070543969064E-2]
[null,null,null,null,null,null,null,null,null,null,null,null,null,null,null,null,null,null,null,null,null,null,null,null,null,null,null,null,0.10999999999999999,3.4155689524524085E-3,-8.9780587158932959E-2]
[null,null,null,null,null,null,null,null,null,null,null,null,null,null,null,null,null,null,null,null,null,null,null,null,null,null,null,null,0.11999999999999998,4.1920287216576984E-3,-0.10679010241836293]
[null,null,null,null,null,null,null,null,null,null,null,null,null,null,null,null,null,null,null,null,null,null,null,null,null,null,null,null,0.12999999999999998,5.0757209921521171E-3,-0.12545720353143017]
["Developed by Prof. Douglas A. Vander Griend, Calvin College, Grand Rapids, MI",null,null,null,null,null,null,null,null,null,null,null,null,null,null,null,null,null,null,null,null,null,null,null,null,null,null,null,0.13999999999999999,6.0755484481916627E-3,-0.14584435860346434]
[null,null,null,null,null,null,null,null,null,null,null,null,null,null,null,null,null,null,null,null,null,null,null,null,null,null,null,null,0.15,7.2011763442661079E-3,-0.16801842594996252]
[null,null,null,null,null,null,null,null,null,null,null,null,null,null,null,null,null,null,null,null,null,null,null,null,null,null,null,null,0.16,8.46310458851127E-3,-0.19205057731620251]
[null,null,null,null,null,null,null,null,null,null,null,null,null,null,null,null,null,null,null,null,null,null,null,null,null,null,null,null,0.17,9.8727474347576859E-3,-0.21801625330201418]
[null,null,null,null,null,null,null,null,null,null,null,null,null,null,null,null,null,null,null,null,null,null,null,null,null,null,null,null,0.18000000000000002,1.144252167887925E-2,-0.24599513854717664]
[null,null,null,null,null,null,null,null,null,null,null,null,null,null,null,null,null,null,null,null,null,null,null,null,null,null,null,null,0.19000000000000003,1.3185944372122737E-2,-0.27607114667644028]
[null,null,null,null,null,null,null,null,null,null,null,null,null,null,null,null,null,null,null,null,null,null,null,null,null,null,null,null,0.20000000000000004,1.5117741197988116E-2,-0.30833240635275899]
[null,null,null,null,null,null,null,null,null,null,null,null,null,null,null,null,null,null,null,null,null,null,null,null,null,null,null,null,0.21000000000000005,1.7253966812661517E-2,-0.34287124038960998]
[null,null,null,null,null,null,null,null,null,null,null,null,null,null,null,null,null,null,null,null,null,null,null,null,null,null,null,null,0.22000000000000006,1.9612138625108123E-2,-0.37978412992493221]
[null,null,null,null,null,null,null,null,null,null,null,null,null,null,null,null,null,null,null,null,null,null,null,null,null,null,null,null,0.23000000000000007,2.2211385695391953E-2,-0.41917165526843603]
[null,null,null,null,null,null,null,null,null,null,null,null,null,null,null,null,null,null,null,null,null,null,null,null,null,null,null,null,0.24000000000000007,2.5072614662933972E-2,{"$f":"0.00831451*$AB$9*AD39*(LN(AD39/$AE$11)-1)/$AE$11","v":-0.46113840425365193}]
[null,null,null,null,null,null,null,null,null,null,null,null,null,null,null,null,null,null,null,null,null,null,null,null,null,null,null,null,0.25000000000000006,2.8218694885361564E-2,-0.50579283777170736]
[null,null,null,null,null,null,null,null,null,null,null,null,null,null,null,null,null,null,null,null,null,null,null,null,null,null,null,null,0.26000000000000006,3.1674665279379059E-2,-0.55324710062354387]
[null,null,null,null,null,null,null,null,null,null,null,null,null,null,null,null,null,null,null,null,null,null,null,null,null,null,null,null,0.27000000000000007,3.5467965714858538E-2,-0.60361676386670982]
[null,null,null,null,null,null,null,null,null,null,null,null,null,null,null,null,null,null,null,null,null,null,null,null,null,null,null,null,0.28000000000000008,3.9628696230603937E-2,-0.65702048239680177]
[null,null,null,null,null,null,null,null,null,null,null,null,null,null,null,null,null,null,null,null,null,null,null,null,null,null,null,null,0.29000000000000009,4.4189907825084099E-2,-0.71357954851594163]
[null,null,null,null,null,null,null,null,null,null,null,null,null,null,null,null,null,null,null,null,null,null,null,null,null,null,null,null,0.3000000000000001,4.9187929139909985E-2,-0.77341731860230989]
[null,null,null,null,null,null,null,null,null,null,null,null,null,null,null,null,null,null,null,null,null,null,null,null,null,null,null,null,0.31000000000000011,{"$f":"IF($AB$5=1,$C$2/($I$5+$F$5+$C$5+($H$4-$E$4-$B$4)*AC46),(0.08205821*$AB$9)/$C$2)^($H$4-$E$4-$B$4)*($I$5+$H$4*AC46)^$H$4/($C$5-$B$4*AC46)^$B$4/($F$5-$E$4*AC46)^$E$4","v":5.4662734012345657E-2},-0.83665848558036626]
[null,null,null,null,null,null,null,null,null,null,null,null,null,null,null,null,null,null,null,null,null,null,null,null,null,null,null,null,0.32000000000000012,6.0658355642939317E-2,-0.90342816454442465]
[null,null,null,null,null,null,null,null,null,null,null,null,null,null,null,null,null,null,null,null,null,null,null,null,null,null,null,null,0.33000000000000013,6.7223354026154508E-2,-0.97385075241451924]
[null,null,null,null,null,null,null,null,null,null,null,null,null,null,null,null,null,null,null,null,null,null,null,null,null,null,null,null,0.34000000000000014,7.4411344350605618E-2,-1.0480485146625422]
[null,null,null,null,null,null,null,null,null,null,null,null,null,null,null,null,null,null,null,null,null,null,null,null,null,null,null,null,0.35000000000000014,8.2281595321262349E-2,-1.1261398426411013]
[null,null,null,null,null,null,null,null,null,null,null,null,null,null,null,null,null,null,null,null,null,null,null,null,null,null,null,null,0.36000000000000015,9.0899707825203374E-2,-1.208237113508974]
[null,null,null,null,null,null,null,null,null,null,null,null,null,null,null,null,null,null,null,null,null,null,null,null,null,null,null,null,0.37000000000000016,0.10033838609938711,-1.2944440707187552]
[null,null,null,null,null,null,null,null,null,null,null,null,null,null,null,null,null,null,null,null,null,null,null,null,null,null,null,null,0.38000000000000017,0.11067831561725969,-1.3848526259463962]
[null,null,null,null,null,null,null,null,null,null,null,null,null,null,null,null,null,null,null,null,null,null,null,null,null,null,null,null,0.39000000000000018,0.12200916435651299,-1.4795389624916289]
[null,null,null,null,null,null,null,null,null,null,null,null,null,null,null,null,null,null,null,null,null,null,null,null,null,null,null,null,0.40000000000000019,0.13443072702331985,-1.5785587946791357]
[null,null,null,null,null,null,null,null,null,null,null,null,null,null,null,null,null,null,null,null,null,null,null,null,null,null,null,null,0.4100000000000002,0.14805423528763897,-1.6819416065361181]
[null,null,null,null,null,null,null,null,null,null,null,null,null,null,null,null,null,null,null,null,null,null,null,null,null,null,null,null,0.42000000000000021,0.16300386125130759,-1.7896836546221395]
[null,null,null,null,null,null,null,null,null,null,null,null,null,null,null,null,null,null,null,null,null,null,null,null,null,null,null,null,0.43000000000000022,0.17941844637595822,-1.901739472589552]
[null,null,null,null,null,null,null,null,null,null,null,null,null,null,null,null,null,null,null,null,null,null,null,null,null,null,null,null,0.44000000000000022,0.19745349412771976,-2.0180115566416164]
[null,null,null,null,null,null,null,null,null,null,null,null,null,null,null,null,null,null,null,null,null,null,null,null,null,null,null,null,0.45000000000000023,0.21728347188224606,-2.1383378387198761]
[null,null,null,null,null,null,null,null,null,null,null,null,null,null,null,null,null,null,null,null,null,null,null,null,null,null,null,null,0.46000000000000024,0.2391044764666678,-2.2624764644133539]
[null,null,null,null,null,null,null,null,null,null,null,null,null,null,null,null,null,null,null,null,null,null,null,null,null,null,null,null,0.47000000000000025,0.26313732845802157,-2.3900872806667115]
[null,null,null,null,null,null,null,null,null,null,null,null,null,null,null,null,null,null,null,null,null,null,null,null,null,null,null,null,0.48000000000000026,0.28963117346798517,-2.5207092985063158]
[null,null,null,null,null,null,null,null,null,null,null,null,null,null,null,null,null,null,null,null,null,null,null,null,null,null,null,null,0.49000000000000027,0.31886768469948212,-2.6537332206477888]
[null,null,null,null,null,null,null,null,null,null,null,null,null,null,null,null,null,null,null,null,null,null,null,null,null,null,null,null,0.50000000000000022,0.35116598079561101,-2.7883679032270932]
[null,null,null,null,null,null,null,null,null,null,null,null,null,null,null,null,null,null,null,null,null,null,null,null,null,null,null,null,0.51000000000000023,0.38688839735064173,-2.9235993423229414]
[null,null,null,null,null,null,null,null,null,null,null,null,null,null,null,null,null,null,null,null,null,null,null,null,null,null,null,null,0.52000000000000024,0.42644728061394821,-3.0581404228619959]
[null,null,null,null,null,null,null,null,null,null,null,null,null,null,null,null,null,null,null,null,null,null,null,null,null,null,null,null,0.53000000000000025,0.47031300943119952,-3.1903692182318193]
[null,null,null,null,null,null,null,null,null,null,null,null,null,null,null,null,null,null,null,null,null,null,null,null,null,null,null,null,0.54000000000000026,0.5190234983241232,-3.318253054908773]
[null,null,null,null,null,null,null,null,null,null,null,null,null,null,null,null,null,null,null,null,null,null,null,null,null,null,null,null,0.55000000000000027,0.57319549339794507,-3.4392548198388377]
[null,null,null,null,null,null,null,null,null,null,null,null,null,null,null,null,null,null,null,null,null,null,null,null,null,null,null,null,0.56000000000000028,0.63353804686321957,-3.5502170388950955]
[null,null,null,null,null,null,null,null,null,null,null,null,null,null,null,null,null,null,null,null,null,null,null,null,null,null,null,null,0.57000000000000028,0.70086864980396579,-3.647218025194737]
[null,null,null,null,null,null,null,null,null,null,null,null,null,null,null,null,null,null,null,null,null,null,null,null,null,null,null,null,0.58000000000000029,0.77613262227828173,-3.7253927958650856]
[null,null,null,null,null,null,null,null,null,null,null,null,null,null,null,null,null,null,null,null,null,null,null,null,null,null,null,null,0.5900000000000003,0.8604265126892463,-3.7787093624714312]
[null,null,null,null,null,null,null,null,null,null,null,null,null,null,null,null,null,null,null,null,null,null,null,null,null,null,null,null,0.60000000000000031,0.95502645502645822,-3.7996882468675142]
[null,null,null,null,null,null,null,null,null,null,null,null,null,null,null,null,null,null,null,null,null,null,null,null,null,null,null,null,0.61000000000000032,1.0614226870665542,-3.7790494318932688]
[null,null,null,null,null,null,null,null,null,null,null,null,null,null,null,null,null,null,null,null,null,null,null,null,null,null,null,null,0.62000000000000033,1.181361763924871,-3.7052661092646701]
[null,null,null,null,null,null,null,null,null,null,null,null,null,null,null,null,null,null,null,null,null,null,null,null,null,null,null,null,0.63000000000000034,{"$f":"IF($AB$5=1,$C$2/($I$5+$F$5+$C$5+($H$4-$E$4-$B$4)*AC78),(0.08205821*$AB$9)/$C$2)^($H$4-$E$4-$B$4)*($I$5+$H$4*AC78)^$H$4/($C$5-$B$4*AC78)^$B$4/($F$5-$E$4*AC78)^$E$4","v":1.3168984353876139},-3.5639980959943984]
[null,null,null,null,null,null,null,null,null,null,null,null,null,null,null,null,null,null,null,null,null,null,null,null,null,null,null,null,0.64000000000000035,1.4704597278631064,-3.3373690404524079]
[null,null,null,null,null,null,null,null,null,null,null,null,null,null,null,null,null,null,null,null,null,null,null,null,null,null,null,null,0.65000000000000036,1.6449245319657746,-3.0030396607961354]
[null,null,null,null,null,null,null,null,null,null,null,null,null,null,null,null,null,null,null,null,null,null,null,null,null,null,null,null,0.66000000000000036,1.8437230137167326,-2.5330130145396468]
[null,null,null,null,null,null,null,null,null,null,null,null,null,null,null,null,null,null,null,null,null,null,null,null,null,null,null,null,{"$f":"(MIN($C$5/$B$4,$F$5/$E$4)+$I$5/$H$4)/100+AC81","v":0.67000000000000037},2.0709615384272735,-1.892085410629061]
[null,null,null,null,null,null,null,null,null,null,null,null,null,null,null,null,null,null,null,null,null,null,null,null,null,null,null,null,0.68000000000000038,2.3315806599950211,-1.0358254662966262]
[null,null,null,null,null,null,null,null,null,null,null,null,null,null,null,null,null,null,null,null,null,null,null,null,null,null,null,null,0.69000000000000039,2.6315562835373623,9.2079795856526231E-2]
[null,null,null,null,null,null,null,null,null,null,null,null,null,null,null,null,null,null,null,null,null,null,null,null,null,null,null,null,0.7000000000000004,2.9781576448243285,1.5633346079628072]
[null,null,null,null,null,null,null,null,null,null,null,null,null,null,null,null,null,null,null,null,null,null,null,null,null,null,null,null,0.71000000000000041,3.3802806897182616,3.469710812963871]
[null,null,null,null,null,null,null,null,null,null,null,null,null,null,null,null,null,null,null,null,null,null,null,null,null,null,null,null,0.72000000000000042,3.8488824101069183,5.9293291071543113]
[null,null,null,null,null,null,null,null,null,null,null,null,null,null,null,null,null,null,null,null,null,null,null,null,null,null,null,null,0.73000000000000043,4.3975516456097701,9.095169134818768]
[null,null,null,null,null,null,null,null,null,null,null,null,null,null,null,null,null,null,null,null,null,null,null,null,null,null,null,null,0.74000000000000044,5.0432662334189446,13.166706863264841]
[null,null,null,null,null,null,null,null,null,null,null,null,null,null,null,null,null,null,null,null,null,null,null,null,null,null,null,null,0.75000000000000044,5.8074074074074451,18.405988359324173]
[null,null,null,null,null,null,null,null,null,null,null,null,null,null,null,null,null,null,null,null,null,null,null,null,null,null,null,null,0.76000000000000045,6.7171335014824036,25.160072098281098]
[null,null,null,null,null,null,null,null,null,null,null,null,null,null,null,null,null,null,null,null,null,null,null,null,null,null,null,null,0.77000000000000046,7.8072618613530214,33.892731047264256]
[null,null,null,null,null,null,null,null,null,null,null,null,null,null,null,null,null,null,null,null,null,null,null,null,null,null,null,null,0.78000000000000047,9.1228794288001147,45.229805947786133]
[null,null,null,null,null,null,null,null,null,null,null,null,null,null,null,null,null,null,null,null,null,null,null,null,null,null,null,null,0.79000000000000048,10.723013627157187,60.024988417075939]
[null,null,null,null,null,null,null,null,null,null,null,null,null,null,null,null,null,null,null,null,null,null,null,null,null,null,null,null,0.80000000000000049,12.685871056241519,79.456682749128959]
[null,null,null,null,null,null,null,null,null,null,null,null,null,null,null,null,null,null,null,null,null,null,null,null,null,null,null,null,0.8100000000000005,15.116435377183516,105.17299894696305]
[null,null,null,null,null,null,null,null,null,null,null,null,null,null,null,null,null,null,null,null,null,null,null,null,null,null,null,null,0.82000000000000051,18.15768403776142,139.51276326953811]
[null,null,null,null,null,null,null,null,null,null,null,null,null,null,null,null,null,null,null,null,null,null,null,null,null,null,null,null,0.83000000000000052,22.007474647520301,185.84921477682241]
[null,null,null,null,null,null,null,null,null,null,null,null,null,null,null,null,null,null,null,null,null,null,null,null,null,null,null,null,0.84000000000000052,26.94452426564521,249.13650915665082]
[null,null,null,null,null,null,null,null,null,null,null,null,null,null,null,null,null,null,null,null,null,null,null,null,null,null,null,null,0.85000000000000053,33.369356474026752,336.80054466026291]
[null,null,null,null,null,null,null,null,null,null,null,null,null,null,null,null,null,null,null,null,null,null,null,null,null,null,null,null,0.86000000000000054,41.870615903158175,460.23212628091937]
[null,null,null,null,null,null,null,null,null,null,null,null,null,null,null,null,null,null,null,null,null,null,null,null,null,null,null,null,0.87000000000000055,53.335813399489055,637.37002365834189]
[null,null,null,null,null,null,null,null,null,null,null,null,null,null,null,null,null,null,null,null,null,null,null,null,null,null,null,null,0.88000000000000056,69.142857142858063,{"$f":"0.00831451*$AB$9*AD103*(LN(AD103/$AE$11)-1)/$AE$11","v":897.3333981849679}]
[null,null,null,null,null,null,null,null,null,null,null,null,null,null,null,null,null,null,null,null,null,null,null,null,null,null,null,null,0.89000000000000057,91.504918837641512,1289.0816838339381]
[null,null,null,null,null,null,null,null,null,null,null,null,null,null,null,null,null,null,null,null,null,null,null,null,null,null,null,null,0.90000000000000058,124.1212121212147,1898.4056881431675]
[null,null,null,null,null,null,null,null,null,null,null,null,null,null,null,null,null,null,null,null,null,null,null,null,null,null,null,null,0.91000000000000059,173.47492806860654,2883.2243428817023]
[null,null,null,null,null,null,null,null,null,null,null,null,null,null,null,null,null,null,null,null,null,null,null,null,null,null,null,null,0.9200000000000006,251.59952751105533,4552.1102426161824]
[null,null,null,null,null,null,null,null,null,null,null,null,null,null,null,null,null,null,null,null,null,null,null,null,null,null,null,null,0.9300000000000006,382.47320337422462,7554.2747670702884]
[null,null,null,null,null,null,null,null,null,null,null,null,null,null,null,null,null,null,null,null,null,null,null,null,null,null,null,null,0.94000000000000061,618.38507130472999,13390.271877743267]
[null,null,null,null,null,null,null,null,null,null,null,null,null,null,null,null,null,null,null,null,null,null,null,null,null,null,null,null,0.95000000000000062,{"$f":"IF($AB$5=1,$C$2/($I$5+$F$5+$C$5+($H$4-$E$4-$B$4)*AC110),(0.08205821*$AB$9)/$C$2)^($H$4-$E$4-$B$4)*($I$5+$H$4*AC110)^$H$4/($C$5-$B$4*AC110)^$B$4/($F$5-$E$4*AC110)^$E$4","v":1087.7397609249881},25985.983441899676]
[null,null,null,null,null,null,null,null,null,null,null,null,null,null,null,null,null,null,null,null,null,null,null,null,null,null,null,null,0.96000000000000063,2162.1424501425427,57535.167810779414]
[null,null,null,null,null,null,null,null,null,null,null,null,null,null,null,null,null,null,null,null,null,null,null,null,null,null,null,null,0.97000000000000064,5214.8167325905351,156947.60296356486]
[null,null,null,null,null,null,null,null,null,null,null,null,null,null,null,null,null,null,null,null,null,null,null,null,null,null,null,null,0.98000000000000065,17904.528040024554,626319.63551263511]
[null,null,null,null,null,null,null,null,null,null,null,null,null,null,null,null,null,null,null,null,null,null,null,null,null,null,null,null,0.99000000000000066,145685.59735976486,6305618.018483365]
[null,null,null,null,null,null,null,null,null,null,null,null,null,null,null,null,null,null,null,null,null,null,null,null,null,null,null,null,{"$f":"MIN($C$5/$B$4,$F$5/$E$4)-(MIN($C$5/$B$4,$F$5/$E$4)+$I$5/$H$4)/250","v":0.996},2299399.1772170514,124644097.51933539]
[null,null,null,null,null,null,null,null,null,null,null,null,null,null,null,null,null,null,null,null,null,null,null,null,null,null,null,null,{"$f":"MIN($C$5/$B$4,$F$5/$E$4)-(MIN($C$5/$B$4,$F$5/$E$4)+$I$5/$H$4)/1000","v":0.999},147901300.41157156,10455943254.877476]

{"sheet":"NO","index":3,"n_rows":116,"n_cols":31,"rows_kept":116,"cut":false,"hidden":false,"merged":[]}
[]
[{"$f":"IF($AB$5=1,\"Pressure:\",\"Volume:\")","v":"Pressure:"},null,1,{"$f":"IF($AB$5=1,\"atm\",\"L\")","v":"atm"},null,null,null,null,null,null,null,null,null,null,null,null,null,null,null,null,null,null,null,null,null,null,null,2,"Celsius","A=",4.0434999999999999]
["Temperature:",null,{"$f":"AB9-273*IF($AB$2=1,1,0)","v":1500},{"$f":"IF(AB2=1,\"C\",\"K\")","v":"K"},null,null,null,null,null,null,null,null,null,null,null,null,null,null,null,null,null,null,null,null,null,null,null,null,"Kelvin"]
["Reaction:",1,"N2","+",1,"O2",null,2,"NO",null,null,null,null,null,null,null,null,null,null,null,null,null,null,null,null,null,null,null,null,"B=",-21718]
["initial (moles):",null,0.8,null,null,0.2,null,null,0,null,"Units:",null,null,null,null,null,null,null,null,null,null,null,null,null,null,null,null,1,"Constant Pressure","C=",-8.1138000000000002E-2]
[{"$f":"IF($AB$7=1,\"initial (atm):\",\"initial (M):\")","v":"initial (atm):"},null,{"$f":"IF($AB$5=1,$C$2*C5/SUM($C$5:$I$5),0.08205821*$AB$9*C5/$C$2)/(0.08205821*$AB$9)^($AB$7-1)","v":0.8},null,null,{"$f":"IF($AB$5=1,$C$2*F5/SUM($C$5:$I$5),0.08205821*$AB$9*F5/$C$2)/(0.08205821*$AB$9)^($AB$7-1)","v":0.2},null,null,{"$f":"IF($AB$5=1,$C$2*I5/SUM($C$5:$I$5),0.08205821*$AB$9*I5/$C$2)/(0.08205821*$AB$9)^($AB$7-1)","v":0},null,{"$f":"IF($AB$7=1,\"Qpi = \",\"Qci = \")","v":"Qpi = "},{"$f":"IF(C5*F5=0,\"∞\",(I6)^$H$4/(F6)^$E$4/(C6)^$B$4)","v":0},null,"Initial Reaction Quotient",null,null,null,null,null,null,null,null,null,null,null,null,null,null,"Constant Volume","D=",3.2571E-4]
["change (moles):",null,{"$f":"MIN(I5/H4)-(AB11/29999)*(MIN(C5/B4,F5/E4)+MIN(I5/H4))","v":-1.0000333344444815E-2},null,null,{"$f":"E4*C7/B4","v":-1.0000333344444815E-2},null,null,{"$f":"-H4*C7/B4","v":2.000066668888963E-2},null,"x =",{"$f":"I7/H4","v":1.0000333344444815E-2},"mol","Extent of Reaction",null,null,null,null,null,null,null,null,null,null,null,null,null,1,"Atmospheres","E=",-1.0605E-7]
[{"$f":"IF(ABS(L9/L10-1)<0.001,\"equilibrium (moles):\",\"equilibrating ... (moles):\")","v":"equilibrating ... (moles):"},null,{"$f":"C7+C5","v":0.78999966665555521},null,null,{"$f":"F7+F5","v":0.1899996666555552},null,null,{"$f":"I7+I5","v":2.000066668888963E-2},null,null,null,null,null,null,null,null,null,null,null,null,null,null,null,null,null,null,null,"Molarity","F=",7.5858999999999998E-12]
[{"$f":"IF(ABS(L9/L10-1)<0.001,IF($AB$7=1,\"equilibrium (atm):\",\"equilibrium (M)\"),IF($AB$7=1,\"equilibrating ... (atm):\",\"equilibrating…(M)\"))","v":"equilibrating ... (atm):"},null,{"$f":"IF($AB$5=1,$C$2*(C5+C7)/SUM($C$5:$I$5,$C$7:$I$7),(C5+C7)*0.08205821*$AB$9/$C$2)/(0.08205821*$AB$9)^($AB$7-1)","v":0.78999966665555521},null,null,{"$f":"IF($AB$5=1,$C$2*(F5+F7)/SUM($C$5:$I$5,$C$7:$I$7),(F5+F7)*0.08205821*$AB$9/$C$2)/(0.08205821*$AB$9)^($AB$7-1)","v":0.1899996666555552},null,null,{"$f":"IF($AB$5=1,$C$2*(I5+I7)/SUM($C$5:$I$5,$C$7:$I$7),(I5+I7)*0.08205821*$AB$9/$C$2)/(0.08205821*$AB$9)^($AB$7-1)","v":2.000066668888963E-2},null,{"$f":"IF($AB$7=1,\"Qp = \",\"Qc = \")","v":"Qp = "},{"$f":"(I9)^H4/(C9)^B4/(F9)^E4","v":2.6650735417686482E-3},null,"Reaction Quotient",null,null,null,null,null,null,null,null,null,null,null,null,null,1500,"Temperature (k)","lnK =",{"$f":"AE2+AE4/AB9+AE5*LN(AB9)+AE6*AB9+AE7*AB9^2+AE8*AB9^3","v":-10.752991829934402}]
[null,null,null,null,null,null,null,null,null,null,{"$f":"IF($AB$7=1,\"Kp = \",\"Kc = \")","v":"Kp = "},{"$f":"IF($AB$7=1,$AE$11,$AE$11*(0.08205821*$AB$9)^(B4+E4-H4))","v":2.1381343185807623E-5},null,"Equilibrium Constant",null,null,null,null,null,null,null,null,null,null,null,null,null,null,null,null," (LnK = A + B/T +ClnK + DT + ET^2 + FT^3)"]
[{"$f":"IF(ABS($L$9/$L$10-1)<0.001,\"\",IF($L$9>$L$10,\"¬\",\"®\"))","v":"¬"},null,{"$f":"IF(ABS(L9/L10-1)<0.001,\"Equilibrium!\",IF(L9>L10,\"Too far.\",\"Not far enough…\"))","v":"Too far."},null,null,null,null,null,{"$f":"IF(ABS($L$9/$L$10-1)<0.001,\"\",IF($L$9>$L$10,\"¬\",\"®\"))","v":"¬"},null,"G =",{"$f":"0.00831451*$AB$9*L9*(LN(L9/L10)-1)/L10","v":5946.8465052832898},"kJ","Gibb's Free Energy",null,null,null,null,null,null,null,null,null,null,null,null,null,1500,"Slider Position (1 - 9999)","Kp =",{"$f":"EXP(AE9)","v":2.1381343185807623E-5}]
[null,null,null,null,null,null,null,null,null,null,"ΔG =",{"$f":"0.00831451*$AB$9*LN(L9/L10)","v":60.182105450267628},"kJ/mol",null,null,null,null,null,null,null,null,null,null,null,null,null,null,null,"x","Qp","G"]
[null,null,null,null,null,null,null,null,null,null,null,null,null,null,null,null,null,null,null,null,null,null,null,null,null,null,null,null,{"$f":"-I5/H4","v":0},0,0]
[null,null,null,null,null,null,null,null,null,null,null,null,null,null,null,null,null,null,null,null,null,null,null,null,null,null,null,null,{"$f":"(MIN($C$5/$B$4,$F$5/$E$4)+$I$5/$H$4)/1000+AC13","v":2.0000000000000001E-4},{"$f":"IF($AB$5=1,$C$2/($I$5+$F$5+$C$5+($H$4-$E$4-$B$4)*AC14),(0.08205821*$AB$9)/$C$2)^($H$4-$E$4-$B$4)*($I$5+$H$4*AC14)^$H$4/($C$5-$B$4*AC14)^$B$4/($F$5-$E$4*AC14)^$E$4","v":1.0012513138294582E-6},{"$f":"0.00831451*$AB$9*AD14*(LN(AD14/$AE$11)-1)/$AE$11","v":-2.3719072572976003}]
[null,null,null,null,null,null,null,null,null,null,null,null,null,null,null,null,null,null,null,null,null,null,null,null,null,null,null,null,{"$f":"(MIN($C$5/$B$4,$F$5/$E$4)+$I$5/$H$4)/250+AC13","v":8.0000000000000004E-4},1.6080337365477926E-5,{"$f":"0.00831451*$AB$9*AD15*(LN(AD15/$AE$11)-1)/$AE$11","v":-12.052154250017322}]
[null,null,null,null,null,null,null,null,null,null,null,null,null,null,null,null,null,null,null,null,null,null,null,null,null,null,null,null,{"$f":"(MIN($C$5/$B$4,$F$5/$E$4)+$I$5/$H$4)/100+AC13","v":2E-3},1.0126325915799599E-4,{"$f":"0.00831451*$AB$9*AD16*(LN(AD16/$AE$11)-1)/$AE$11","v":32.79428336350486}]
[null,null,null,null,null,null,null,null,null,null,null,null,null,null,null,null,null,null,null,null,null,null,null,null,null,null,null,null,{"$f":"(MIN($C$5/$B$4,$F$5/$E$4)+$I$5/$H$4)/100+AC16","v":4.0000000000000001E-3},4.1021433699107778E-4,{"$f":"0.00831451*$AB$9*AD17*(LN(AD17/$AE$11)-1)/$AE$11","v":467.58882833510728}]
[null,null,null,null,null,null,null,null,null,null,null,null,null,null,null,null,null,null,null,null,null,null,null,null,null,null,null,null,{"$f":"(MIN($C$5/$B$4,$F$5/$E$4)+$I$5/$H$4)/100+AC17","v":6.0000000000000001E-3},9.3484639954296385E-4,{"$f":"0.00831451*$AB$9*AD18*(LN(AD18/$AE$11)-1)/$AE$11","v":1514.7609382218538}]
[null,null,null,null,null,null,null,null,null,null,null,null,null,null,null,null,null,null,null,null,null,null,null,null,null,null,null,null,8.0000000000000002E-3,1.6835016835016832E-3,3305.4844442880622]
[null,null,null,null,null,null,null,null,null,null,null,null,null,null,null,null,null,null,null,null,null,null,null,null,null,null,null,null,0.01,2.6648900732844771E-3,5946.3300998918075]
[null,null,null,null,null,null,null,null,null,null,null,null,null,null,null,null,null,null,null,null,null,null,null,null,null,null,null,null,1.2E-2,3.8881088670482777E-3,9532.5088195167809]
[null,null,null,null,null,null,null,null,null,null,null,null,null,null,null,null,null,null,null,null,null,null,null,null,null,null,null,null,1.4E-2,5.3626638211715779E-3,14153.47381163305]
[null,null,null,null,null,null,null,null,null,null,null,null,null,null,null,null,null,null,null,null,null,null,null,null,null,null,null,null,1.6E-2,7.0984915705412594E-3,19895.879426760108]
[null,null,null,null,null,null,null,null,null,null,null,null,null,null,null,null,null,null,null,null,null,null,null,null,null,null,null,null,1.8000000000000002E-2,9.1059835305359622E-3,26845.376111726328]
[null,null,null,null,null,null,null,null,null,null,null,null,null,null,null,null,null,null,null,null,null,null,null,null,null,null,null,null,2.0000000000000004E-2,1.1396011396011402E-2,35087.815669517848]
[null,null,null,null,null,null,null,null,null,null,null,null,null,null,null,null,null,null,null,null,null,null,null,null,null,null,null,null,2.2000000000000006E-2,1.3979954362958905E-2,44710.129333202902]
[null,null,null,null,null,null,null,null,null,null,null,null,null,null,null,null,null,null,null,null,null,null,null,null,null,null,null,null,2.4000000000000007E-2,1.6869728209934407E-2,55801.013080719393]
[null,null,null,null,null,null,null,null,null,null,null,null,null,null,null,null,null,null,null,null,null,null,null,null,null,null,null,null,2.6000000000000009E-2,2.0077816388963155E-2,68451.49516262472]
["Developed by Prof. Douglas A. Vander Griend, Calvin College, Grand Rapids, MI",null,null,null,null,null,null,null,null,null,null,null,null,null,null,null,null,null,null,null,null,null,null,null,null,null,null,null,2.8000000000000011E-2,2.3617303289552981E-2,82755.430621551655]
[null,null,null,null,null,null,null,null,null,null,null,null,null,null,null,null,null,null,null,null,null,null,null,null,null,null,null,null,3.0000000000000013E-2,2.7501909854851053E-2,98809.951156062903]
[null,null,null,null,null,null,null,null,null,null,null,null,null,null,null,null,null,null,null,null,null,null,null,null,null,null,null,null,3.2000000000000015E-2,3.1746031746031779E-2,116715.8892524621]
[null,null,null,null,null,null,null,null,null,null,null,null,null,null,null,null,null,null,null,null,null,null,null,null,null,null,null,null,3.4000000000000016E-2,3.6364780269904723E-2,136578.18986505104]
[null,null,null,null,null,null,null,null,null,null,null,null,null,null,null,null,null,null,null,null,null,null,null,null,null,null,null,null,3.6000000000000018E-2,4.1374026305708134E-2,158506.31944162273]
[null,null,null,null,null,null,null,null,null,null,null,null,null,null,null,null,null,null,null,null,null,null,null,null,null,null,null,null,3.800000000000002E-2,4.6790447490360057E-2,182614.67989646379]
[null,null,null,null,null,null,null,null,null,null,null,null,null,null,null,null,null,null,null,null,null,null,null,null,null,null,null,null,4.0000000000000022E-2,5.2631578947368494E-2,209023.03374078797]
[null,null,null,null,null,null,null,null,null,null,null,null,null,null,null,null,null,null,null,null,null,null,null,null,null,null,null,null,4.2000000000000023E-2,5.8915867873484587E-2,237856.94570728194]
[null,null,null,null,null,null,null,null,null,null,null,null,null,null,null,null,null,null,null,null,null,null,null,null,null,null,null,null,4.4000000000000025E-2,6.5662732329399079E-2,269248.24568167166]
[null,null,null,null,null,null,null,null,null,null,null,null,null,null,null,null,null,null,null,null,null,null,null,null,null,null,null,null,4.6000000000000027E-2,7.2892624616762644E-2,303335.51747577544]
[null,null,null,null,null,null,null,null,null,null,null,null,null,null,null,null,null,null,null,null,null,null,null,null,null,null,null,null,4.8000000000000029E-2,8.0627099664053861E-2,340264.61787849019]
[null,null,null,null,null,null,null,null,null,null,null,null,null,null,null,null,null,null,null,null,null,null,null,null,null,null,null,null,5.0000000000000031E-2,8.8888888888889017E-2,380189.23046288401]
[null,null,null,null,null,null,null,null,null,null,null,null,null,null,null,null,null,null,null,null,null,null,null,null,null,null,null,null,5.2000000000000032E-2,9.7701980054921381E-2,423271.45878393098]
[null,null,null,null,null,null,null,null,null,null,null,null,null,null,null,null,null,null,null,null,null,null,null,null,null,null,null,null,5.4000000000000034E-2,0.10709170369826304,469682.46385762887]
[null,null,null,null,null,null,null,null,null,null,null,null,null,null,null,null,null,null,null,null,null,null,null,null,null,null,null,null,5.6000000000000036E-2,0.11708482676224628,519603.15116063296]
[null,null,null,null,null,null,null,null,null,null,null,null,null,null,null,null,null,null,null,null,null,null,null,null,null,null,null,null,5.8000000000000038E-2,0.12770965415132324,573224.91282772378]
[null,null,null,null,null,null,null,null,null,null,null,null,null,null,null,null,null,null,null,null,null,null,null,null,null,null,null,null,6.0000000000000039E-2,0.13899613899613922,630750.43125405011]
[null,null,null,null,null,null,null,null,null,null,null,null,null,null,null,null,null,null,null,null,null,null,null,null,null,null,null,null,6.2000000000000041E-2,{"$f":"IF($AB$5=1,$C$2/($I$5+$F$5+$C$5+($H$4-$E$4-$B$4)*AC46),(0.08205821*$AB$9)/$C$2)^($H$4-$E$4-$B$4)*($I$5+$H$4*AC46)^$H$4/($C$5-$B$4*AC46)^$B$4/($F$5-$E$4*AC46)^$E$4","v":0.15097600251364857},692394.5509351911]
[null,null,null,null,null,null,null,null,null,null,null,null,null,null,null,null,null,null,null,null,null,null,null,null,null,null,null,null,6.4000000000000043E-2,0.16368286445012817,758385.22610876872]
[null,null,null,null,null,null,null,null,null,null,null,null,null,null,null,null,null,null,null,null,null,null,null,null,null,null,null,null,6.6000000000000045E-2,0.17715238521290039,828964.55260766845]
[null,null,null,null,null,null,null,null,null,null,null,null,null,null,null,null,null,null,null,null,null,null,null,null,null,null,null,null,6.8000000000000047E-2,0.19142242093061798,904389.89331099601]
[null,null,null,null,null,null,null,null,null,null,null,null,null,null,null,null,null,null,null,null,null,null,null,null,null,null,null,null,7.0000000000000048E-2,0.20653319283456306,984935.10770206852]
[null,null,null,null,null,null,null,null,null,null,null,null,null,null,null,null,null,null,null,null,null,null,null,null,null,null,null,null,7.200000000000005E-2,0.22252747252747293,1070891.8973341128]
[null,null,null,null,null,null,null,null,null,null,null,null,null,null,null,null,null,null,null,null,null,null,null,null,null,null,null,null,7.4000000000000052E-2,0.23945078490533081,1162571.2804891176]
[null,null,null,null,null,null,null,null,null,null,null,null,null,null,null,null,null,null,null,null,null,null,null,null,null,null,null,null,7.6000000000000054E-2,0.25735163072536138,1260305.2110236799]
[null,null,null,null,null,null,null,null,null,null,null,null,null,null,null,null,null,null,null,null,null,null,null,null,null,null,null,null,7.8000000000000055E-2,0.27628173107488357,1364448.3583635991]
[null,null,null,null,null,null,null,null,null,null,null,null,null,null,null,null,null,null,null,null,null,null,null,null,null,null,null,null,8.0000000000000057E-2,0.29629629629629683,1475380.0678792379]
[null,null,null,null,null,null,null,null,null,null,null,null,null,null,null,null,null,null,null,null,null,null,null,null,null,null,null,null,8.2000000000000059E-2,0.31745432226995951,1593506.5234973384]
[null,null,null,null,null,null,null,null,null,null,null,null,null,null,null,null,null,null,null,null,null,null,null,null,null,null,null,null,8.4000000000000061E-2,0.33981891735696468,1719263.1374429972]
[null,null,null,null,null,null,null,null,null,null,null,null,null,null,null,null,null,null,null,null,null,null,null,null,null,null,null,null,8.6000000000000063E-2,0.36345766376726202,1853117.1955308006]
[null,null,null,null,null,null,null,null,null,null,null,null,null,null,null,null,null,null,null,null,null,null,null,null,null,null,null,null,8.8000000000000064E-2,0.38844301765650152,1995570.7905241936]
[null,null,null,null,null,null,null,null,null,null,null,null,null,null,null,null,null,null,null,null,null,null,null,null,null,null,null,null,9.0000000000000066E-2,0.41485275288092271,2147164.0808621417]
[null,null,null,null,null,null,null,null,null,null,null,null,null,null,null,null,null,null,null,null,null,null,null,null,null,null,null,null,9.2000000000000068E-2,0.44277045406989007,2308478.9176389999]
[null,null,null,null,null,null,null,null,null,null,null,null,null,null,null,null,null,null,null,null,null,null,null,null,null,null,null,null,9.400000000000007E-2,0.47228606552995978,2480142.8892705757]
[null,null,null,null,null,null,null,null,null,null,null,null,null,null,null,null,null,null,null,null,null,null,null,null,null,null,null,null,9.6000000000000071E-2,0.50349650349650454,2662833.8409730545]
[null,null,null,null,null,null,null,null,null,null,null,null,null,null,null,null,null,null,null,null,null,null,null,null,null,null,null,null,9.8000000000000073E-2,0.53650634042791012,2857284.9352483847]
[null,null,null,null,null,null,null,null,null,null,null,null,null,null,null,null,null,null,null,null,null,null,null,null,null,null,null,null,0.10000000000000007,0.57142857142857273,3064290.3302872661]
[null,null,null,null,null,null,null,null,null,null,null,null,null,null,null,null,null,null,null,null,null,null,null,null,null,null,null,null,0.10200000000000008,0.60838547453365444,3284711.5659086867]
[null,null,null,null,null,null,null,null,null,null,null,null,null,null,null,null,null,null,null,null,null,null,null,null,null,null,null,null,0.10400000000000008,0.64750957854406288,3519484.7617718624]
[null,null,null,null,null,null,null,null,null,null,null,null,null,null,null,null,null,null,null,null,null,null,null,null,null,null,null,null,0.10600000000000008,0.68894475443007097,3769628.7506393981]
[null,null,null,null,null,null,null,null,null,null,null,null,null,null,null,null,null,null,null,null,null,null,null,null,null,null,null,null,0.10800000000000008,0.73284744910781785,4036254.2910818886]
[null,null,null,null,null,null,null,null,null,null,null,null,null,null,null,null,null,null,null,null,null,null,null,null,null,null,null,null,0.11000000000000008,0.77938808373591173,4320574.5299941711]
[null,null,null,null,null,null,null,null,null,null,null,null,null,null,null,null,null,null,null,null,null,null,null,null,null,null,null,null,0.11200000000000009,0.82875264270613302,4623916.916644291]
[null,null,null,null,null,null,null,null,null,null,null,null,null,null,null,null,null,null,null,null,null,null,null,null,null,null,null,null,0.11400000000000009,0.88114448437182402,4947736.8079586057]
[null,null,null,null,null,null,null,null,null,null,null,null,null,null,null,null,null,null,null,null,null,null,null,null,null,null,null,null,0.11600000000000009,0.93678641047062328,5293633.0509540047]
[null,null,null,null,null,null,null,null,null,null,null,null,null,null,null,null,null,null,null,null,null,null,null,null,null,null,null,null,0.11800000000000009,0.99592303840927232,5663365.8846858609]
[null,null,null,null,null,null,null,null,null,null,null,null,null,null,null,null,null,null,null,null,null,null,null,null,null,null,null,null,0.12000000000000009,1.0588235294117674,6058877.5733742602]
[null,null,null,null,null,null,null,null,null,null,null,null,null,null,null,null,null,null,null,null,null,null,null,null,null,null,null,null,0.12200000000000009,1.1257847364042084,6482316.2678235164]
[null,null,null,null,null,null,null,null,null,null,null,null,null,null,null,null,null,null,null,null,null,null,null,null,null,null,null,null,0.1240000000000001,1.1971348489567146,6936063.6981523447]
[null,null,null,null,null,null,null,null,null,null,null,null,null,null,null,null,null,null,null,null,null,null,null,null,null,null,null,null,0.12600000000000008,{"$f":"IF($AB$5=1,$C$2/($I$5+$F$5+$C$5+($H$4-$E$4-$B$4)*AC78),(0.08205821*$AB$9)/$C$2)^($H$4-$E$4-$B$4)*($I$5+$H$4*AC78)^$H$4/($C$5-$B$4*AC78)^$B$4/($F$5-$E$4*AC78)^$E$4","v":1.2732376293207186},7422767.4327827645]
[null,null,null,null,null,null,null,null,null,null,null,null,null,null,null,null,null,null,null,null,null,null,null,null,null,null,null,null,0.12800000000000009,1.354497354497358,7945378.6038917629]
[null,null,null,null,null,null,null,null,null,null,null,null,null,null,null,null,null,null,null,null,null,null,null,null,null,null,null,null,0.13000000000000009,1.4413646055437137,8507196.2077203263]
[null,null,null,null,null,null,null,null,null,null,null,null,null,null,null,null,null,null,null,null,null,null,null,null,null,null,null,null,0.13200000000000009,1.5343430785487886,9111919.3520041592]
[null,null,null,null,null,null,null,null,null,null,null,null,null,null,null,null,null,null,null,null,null,null,null,null,null,null,null,null,{"$f":"(MIN($C$5/$B$4,$F$5/$E$4)+$I$5/$H$4)/100+AC81","v":0.13400000000000009},1.6339976339976383,{"$f":"0.00831451*$AB$9*AD82*(LN(AD82/$AE$11)-1)/$AE$11","v":9763709.159366861}]
[null,null,null,null,null,null,null,null,null,null,null,null,null,null,null,null,null,null,null,null,null,null,null,null,null,null,null,null,0.13600000000000009,1.7409638554216917,10467262.467729855]
[null,null,null,null,null,null,null,null,null,null,null,null,null,null,null,null,null,null,null,null,null,null,null,null,null,null,null,null,0.13800000000000009,1.8559594581424865,11227900.027778048]
[null,null,null,null,null,null,null,null,null,null,null,null,null,null,null,null,null,null,null,null,null,null,null,null,null,null,null,null,0.1400000000000001,1.9797979797979857,12051672.625921283]
[null,null,null,null,null,null,null,null,null,null,null,null,null,null,null,null,null,null,null,null,null,null,null,null,null,null,null,null,0.1420000000000001,2.1134053034273204,12945489.517965393]
[null,null,null,null,null,null,null,null,null,null,null,null,null,null,null,null,null,null,null,null,null,null,null,null,null,null,null,null,0.1440000000000001,2.2578397212543626,13917274.826163065]
[null,null,null,null,null,null,null,null,null,null,null,null,null,null,null,null,null,null,null,null,null,null,null,null,null,null,null,null,0.1460000000000001,2.4143164571299205,14976159.246577827]
[null,null,null,null,null,null,null,null,null,null,null,null,null,null,null,null,null,null,null,null,null,null,null,null,null,null,null,null,0.1480000000000001,2.5842378480415378,16132716.700428002]
[null,null,null,null,null,null,null,null,null,null,null,null,null,null,null,null,null,null,null,null,null,null,null,null,null,null,null,null,0.15000000000000011,2.7692307692307785,17399258.68144596]
[null,null,null,null,null,null,null,null,null,null,null,null,null,null,null,null,null,null,null,null,null,null,null,null,null,null,null,null,0.15200000000000011,2.9711934156378708,18790203.350992586]
[null,null,null,null,null,null,null,null,null,null,null,null,null,null,null,null,null,null,null,null,null,null,null,null,null,null,null,null,0.15400000000000011,3.1923542872526705,20322542.43205858]
[null,null,null,null,null,null,null,null,null,null,null,null,null,null,null,null,null,null,null,null,null,null,null,null,null,null,null,null,0.15600000000000011,3.4353472614342313,22016437.432073321]
[null,null,null,null,null,null,null,null,null,null,null,null,null,null,null,null,null,null,null,null,null,null,null,null,null,null,null,null,0.15800000000000011,3.7033081145230824,23895988.874201722]
[null,null,null,null,null,null,null,null,null,null,null,null,null,null,null,null,null,null,null,null,null,null,null,null,null,null,null,null,0.16000000000000011,4.0000000000000169,25990239.890034731]
[null,null,null,null,null,null,null,null,null,null,null,null,null,null,null,null,null,null,null,null,null,null,null,null,null,null,null,null,0.16200000000000012,4.329978551394178,28334501.657382395]
[null,null,null,null,null,null,null,null,null,null,null,null,null,null,null,null,null,null,null,null,null,null,null,null,null,null,null,null,0.16400000000000012,4.6988120195667573,30972127.497780349]
[null,null,null,null,null,null,null,null,null,null,null,null,null,null,null,null,null,null,null,null,null,null,null,null,null,null,null,null,0.16600000000000012,5.1133791055854765,33956922.816934183]
[null,null,null,null,null,null,null,null,null,null,null,null,null,null,null,null,null,null,null,null,null,null,null,null,null,null,null,null,0.16800000000000012,5.5822784810126871,37356472.750323154]
[null,null,null,null,null,null,null,null,null,null,null,null,null,null,null,null,null,null,null,null,null,null,null,null,null,null,null,null,0.17000000000000012,6.1164021164021491,41256821.456593007]
[null,null,null,null,null,null,null,null,null,null,null,null,null,null,null,null,null,null,null,null,null,null,null,null,null,null,null,null,0.17200000000000013,6.7297543221110478,45769187.877302885]
[null,null,null,null,null,null,null,null,null,null,null,null,null,null,null,null,null,null,null,null,null,null,null,null,null,null,null,null,0.17400000000000013,7.4406488080609936,51039829.185727604]
[null,null,null,null,null,null,null,null,null,null,null,null,null,null,null,null,null,null,null,null,null,null,null,null,null,null,null,null,0.17600000000000013,8.2735042735043276,57264912.787534632]
[null,null,null,null,null,null,null,null,null,null,null,null,null,null,null,null,null,null,null,null,null,null,null,null,null,null,null,null,0.17800000000000013,9.2616194095294428,64713627.387217611]
[null,null,null,null,null,null,null,null,null,null,null,null,null,null,null,null,null,null,null,null,null,null,null,null,null,null,null,null,0.18000000000000013,10.451612903225888,73765379.587688804]
[null,null,null,null,null,null,null,null,null,null,null,null,null,null,null,null,null,null,null,null,null,null,null,null,null,null,null,null,0.18200000000000013,11.910823444804128,84972183.862860575]
[null,null,null,null,null,null,null,null,null,null,null,null,null,null,null,null,null,null,null,null,null,null,null,null,null,null,null,null,0.18400000000000014,13.740259740259871,99168602.473082721]
[null,null,null,null,null,null,null,null,null,null,null,null,null,null,null,null,null,null,null,null,null,null,null,null,null,null,null,null,0.18600000000000014,16.098650535132791,117677475.42076154]
[null,null,null,null,null,null,null,null,null,null,null,null,null,null,null,null,null,null,null,null,null,null,null,null,null,null,null,null,0.18800000000000014,19.250544662309604,142724870.25384]
[null,null,null,null,null,null,null,null,null,null,null,null,null,null,null,null,null,null,null,null,null,null,null,null,null,null,null,null,0.19000000000000014,{"$f":"IF($AB$5=1,$C$2/($I$5+$F$5+$C$5+($H$4-$E$4-$B$4)*AC110),(0.08205821*$AB$9)/$C$2)^($H$4-$E$4-$B$4)*($I$5+$H$4*AC110)^$H$4/($C$5-$B$4*AC110)^$B$4/($F$5-$E$4*AC110)^$E$4","v":23.672131147541332},178361744.89962283]
[null,null,null,null,null,null,null,null,null,null,null,null,null,null,null,null,null,null,null,null,null,null,null,null,null,null,null,null,0.19200000000000014,30.315789473684763,232793838.43027949]
[null,null,null,null,null,null,null,null,null,null,null,null,null,null,null,null,null,null,null,null,null,null,null,null,null,null,null,null,0.19400000000000014,41.403740374038399,325465690.72262406]
[null,null,null,null,null,null,null,null,null,null,null,null,null,null,null,null,null,null,null,null,null,null,null,null,null,null,null,null,0.19600000000000015,63.602649006624766,515892646.76630378]
[null,null,null,null,null,null,null,null,null,null,null,null,null,null,null,null,null,null,null,null,null,null,null,null,null,null,null,null,0.19800000000000015,130.24584717608889,1110902499.0868788]
[null,null,null,null,null,null,null,null,null,null,null,null,null,null,null,null,null,null,null,null,null,null,null,null,null,null,null,null,{"$f":"MIN($C$5/$B$4,$F$5/$E$4)-(MIN($C$5/$B$4,$F$5/$E$4)+$I$5/$H$4)/250","v":0.19920000000000002},330.23169107856393,2995848786.4529338]
[null,null,null,null,null,null,null,null,null,null,null,null,null,null,null,null,null,null,null,null,null,null,null,null,null,null,null,null,{"$f":"MIN($C$5/$B$4,$F$5/$E$4)-(MIN($C$5/$B$4,$F$5/$E$4)+$I$5/$H$4)/1000","v":0.19980000000000001},1330.2245918026945,13148843045.337168]

{"sheet":"Fe(SCN)","index":4,"n_rows":116,"n_cols":31,"rows_kept":116,"cut":false,"hidden":false,"merged":[]}
[]
[{"$f":"IF($AB$5=1,\"Pressure:\",\"Volume:\")","v":"Pressure:"},null,0.1,{"$f":"IF($AB$5=1,\"atm\",\"L\")","v":"atm"},null,null,null,null,null,null,null,null,null,null,null,null,null,null,null,null,null,null,null,null,null,null,null,1,"Celsius","A=",1.8]
["Temperature:",null,{"$f":"AB9-273*IF($AB$2=1,1,0)","v":1131},{"$f":"IF(AB2=1,\"C\",\"K\")","v":"C"},null,null,null,null,null,null,null,null,null,null,null,null,null,null,null,null,null,null,null,null,null,null,null,null,"Kelvin"]
["Reaction:",1,"Fe+3","+",1,"SCN-1",null,1,"Fe(SCN)+2",null,null,null,null,null,null,null,null,null,null,null,null,null,null,null,null,null,null,null,null,"B=",0]
["initial (moles):",null,0.01,null,null,0.01,null,null,0,null,"Units:",null,null,null,null,null,null,null,null,null,null,null,null,null,null,null,null,1,"Constant Pressure","C=",0]
[{"$f":"IF($AB$7=1,\"initial (atm):\",\"initial (M):\")","v":"initial (M):"},null,{"$f":"IF($AB$5=1,$C$2*C5/SUM($C$5:$I$5),0.08205821*$AB$9*C5/$C$2)/(0.08205821*$AB$9)^($AB$7-1)","v":4.3399113400762227E-4},null,null,{"$f":"IF($AB$5=1,$C$2*F5/SUM($C$5:$I$5),0.08205821*$AB$9*F5/$C$2)/(0.08205821*$AB$9)^($AB$7-1)","v":4.3399113400762227E-4},null,null,{"$f":"IF($AB$5=1,$C$2*I5/SUM($C$5:$I$5),0.08205821*$AB$9*I5/$C$2)/(0.08205821*$AB$9)^($AB$7-1)","v":0},null,{"$f":"IF($AB$7=1,\"Qpi = \",\"Qci = \")","v":"Qci = "},{"$f":"IF(C5*F5=0,\"∞\",(I6)^$H$4/(F6)^$E$4/(C6)^$B$4)","v":0},null,"Initial Reaction Quotient",null,null,null,null,null,null,null,null,null,null,null,null,null,null,"Constant Volume","D=",0]
["change (moles):",null,{"$f":"MIN(I5/H4)-(AB11/29999)*(MIN(C5/B4,F5/E4)+MIN(I5/H4))","v":-5.0001666722224072E-4},null,null,{"$f":"E4*C7/B4","v":-5.0001666722224072E-4},null,null,{"$f":"-H4*C7/B4","v":5.0001666722224072E-4},null,"x =",{"$f":"I7/H4","v":5.0001666722224072E-4},"mol","Extent of Reaction",null,null,null,null,null,null,null,null,null,null,null,null,null,2,"Atmospheres","E=",0]
[{"$f":"IF(ABS(L9/L10-1)<0.001,\"equilibrium (moles):\",\"equilibrating ... (moles):\")","v":"equilibrating ... (moles):"},null,{"$f":"C7+C5","v":9.4999833327777602E-3},null,null,{"$f":"F7+F5","v":9.4999833327777602E-3},null,null,{"$f":"I7+I5","v":5.0001666722224072E-4},null,null,null,null,null,null,null,null,null,null,null,null,null,null,null,null,null,null,null,"Molarity","F=",0]
[{"$f":"IF(ABS(L9/L10-1)<0.001,IF($AB$7=1,\"equilibrium (atm):\",\"equilibrium (M)\"),IF($AB$7=1,\"equilibrating ... (atm):\",\"equilibrating…(M)\"))","v":"equilibrating…(M)"},null,{"$f":"IF($AB$5=1,$C$2*(C5+C7)/SUM($C$5:$I$5,$C$7:$I$7),(C5+C7)*0.08205821*$AB$9/$C$2)/(0.08205821*$AB$9)^($AB$7-1)","v":4.2286277575586274E-4},null,null,{"$f":"IF($AB$5=1,$C$2*(F5+F7)/SUM($C$5:$I$5,$C$7:$I$7),(F5+F7)*0.08205821*$AB$9/$C$2)/(0.08205821*$AB$9)^($AB$7-1)","v":4.2286277575586274E-4},null,null,{"$f":"IF($AB$5=1,$C$2*(I5+I7)/SUM($C$5:$I$5,$C$7:$I$7),(I5+I7)*0.08205821*$AB$9/$C$2)/(0.08205821*$AB$9)^($AB$7-1)","v":2.225671650351921E-5},null,{"$f":"IF($AB$7=1,\"Qp = \",\"Qc = \")","v":"Qc = "},{"$f":"(I9)^H4/(C9)^B4/(F9)^E4","v":124.46928117556479},null,"Reaction Quotient",null,null,null,null,null,null,null,null,null,null,null,null,null,1404,"Temperature (k)","lnK =",{"$f":"AE2+AE4/AB9+AE5*LN(AB9)+AE6*AB9+AE7*AB9^2+AE8*AB9^3","v":1.8}]
[null,null,null,null,null,null,null,null,null,null,{"$f":"IF($AB$7=1,\"Kp = \",\"Kc = \")","v":"Kc = "},{"$f":"IF($AB$7=1,$AE$11,$AE$11*(0.08205821*$AB$9)^(E4+B4-H4))","v":696.97823185331424},null,"Equilibrium Constant",null,null,null,null,null,null,null,null,null,null,null,null,null,null,null,null," (LnK = A + B/T +ClnK + DT + ET^2 + FT^3)"]
[{"$f":"IF(ABS($L$9/$L$10-1)<0.001,\"\",IF($L$9>$L$10,\"¬\",\"®\"))","v":"®"},null,{"$f":"IF(ABS(L9/L10-1)<0.001,\"Equilibrium!\",IF(L9>L10,\"Too far.\",\"Not far enough…\"))","v":"Not far enough…"},null,null,null,null,null,{"$f":"IF(ABS($L$9/$L$10-1)<0.001,\"\",IF($L$9>$L$10,\"¬\",\"®\"))","v":"®"},null,"G =",{"$f":"0.00831451*$AB$9*L9*(LN(L9/L10)-1)/L10","v":-5.6760441589741468},"kJ","Gibb's Free Energy",null,null,null,null,null,null,null,null,null,null,null,null,null,1500,"Slider Position (1 - 9999)","Kp =",{"$f":"EXP(AE9)","v":6.0496474644129465}]
[null,null,null,null,null,null,null,null,null,null,"ΔG =",{"$f":"0.00831451*$AB$9*LN(L9/L10)","v":-20.110006883887696},"kJ/mol",null,null,null,null,null,null,null,null,null,null,null,null,null,null,null,"x","Qp","G"]
[null,null,null,null,null,null,null,null,null,null,null,null,null,null,null,null,null,null,null,null,null,null,null,null,null,null,null,null,{"$f":"-I5/H4","v":0},0,0]
[null,null,null,null,null,null,null,null,null,null,null,null,null,null,null,null,null,null,null,null,null,null,null,null,null,null,null,null,{"$f":"(MIN($C$5/$B$4,$F$5/$E$4)+$I$5/$H$4)/1000+AC13","v":1.0000000000000001E-5},{"$f":"IF($AB$5=1,$C$2/($I$5+$F$5+$C$5+($H$4-$E$4-$B$4)*AC14),(0.08205821*$AB$9)/$C$2)^($H$4-$E$4-$B$4)*($I$5+$H$4*AC14)^$H$4/($C$5-$B$4*AC14)^$B$4/($F$5-$E$4*AC14)^$E$4","v":2.003004005006007E-2},{"$f":"0.00831451*$AB$9*AD14*(LN(AD14/$AE$11)-1)/$AE$11","v":-0.25936527535738901}]
[null,null,null,null,null,null,null,null,null,null,null,null,null,null,null,null,null,null,null,null,null,null,null,null,null,null,null,null,{"$f":"(MIN($C$5/$B$4,$F$5/$E$4)+$I$5/$H$4)/250+AC13","v":4.0000000000000003E-5},8.0482572861728038E-2,{"$f":"0.00831451*$AB$9*AD15*(LN(AD15/$AE$11)-1)/$AE$11","v":-0.82615946992473577}]
[null,null,null,null,null,null,null,null,null,null,null,null,null,null,null,null,null,null,null,null,null,null,null,null,null,null,null,null,{"$f":"(MIN($C$5/$B$4,$F$5/$E$4)+$I$5/$H$4)/100+AC13","v":1E-4},0.20304050607080903,{"$f":"0.00831451*$AB$9*AD16*(LN(AD16/$AE$11)-1)/$AE$11","v":-1.7216743552904787}]
[null,null,null,null,null,null,null,null,null,null,null,null,null,null,null,null,null,null,null,null,null,null,null,null,null,null,null,null,{"$f":"(MIN($C$5/$B$4,$F$5/$E$4)+$I$5/$H$4)/100+AC16","v":2.0000000000000001E-4},0.4123281965847565,{"$f":"0.00831451*$AB$9*AD17*(LN(AD17/$AE$11)-1)/$AE$11","v":-2.9326786950269255}]
[null,null,null,null,null,null,null,null,null,null,null,null,null,null,null,null,null,null,null,null,null,null,null,null,null,null,null,null,{"$f":"(MIN($C$5/$B$4,$F$5/$E$4)+$I$5/$H$4)/100+AC17","v":3.0000000000000003E-4},0.62812201084068442,{"$f":"0.00831451*$AB$9*AD18*(LN(AD18/$AE$11)-1)/$AE$11","v":-3.9573427917005746}]
[null,null,null,null,null,null,null,null,null,null,null,null,null,null,null,null,null,null,null,null,null,null,null,null,null,null,null,null,4.0000000000000002E-4,0.85069444444444431,-4.8617060304607511]
[null,null,null,null,null,null,null,null,null,null,null,null,null,null,null,null,null,null,null,null,null,null,null,null,null,null,null,null,5.0000000000000001E-4,1.0803324099722993,-5.6759149150198178]
[null,null,null,null,null,null,null,null,null,null,null,null,null,null,null,null,null,null,null,null,null,null,null,null,null,null,null,null,6.0000000000000006E-4,1.3173381620642823,-6.4169237904124188]
[null,null,null,null,null,null,null,null,null,null,null,null,null,null,null,null,null,null,null,null,null,null,null,null,null,null,null,null,7.000000000000001E-4,1.562030292519367,-7.0953220362858804]
[null,null,null,null,null,null,null,null,null,null,null,null,null,null,null,null,null,null,null,null,null,null,null,null,null,null,null,null,8.0000000000000015E-4,1.8147448015122876,-7.7181234028334975]
[null,null,null,null,null,null,null,null,null,null,null,null,null,null,null,null,null,null,null,null,null,null,null,null,null,null,null,null,9.0000000000000019E-4,2.0758362516604274,-8.2901186160839675]
[null,null,null,null,null,null,null,null,null,null,null,null,null,null,null,null,null,null,null,null,null,null,null,null,null,null,null,null,1.0000000000000002E-3,2.3456790123456797,-8.814608781216144]
[null,null,null,null,null,null,null,null,null,null,null,null,null,null,null,null,null,null,null,null,null,null,null,null,null,null,null,null,1.1000000000000003E-3,2.6246686024491868,-9.2938354733307627]
[null,null,null,null,null,null,null,null,null,null,null,null,null,null,null,null,null,null,null,null,null,null,null,null,null,null,null,null,1.2000000000000003E-3,2.9132231404958682,-9.7292477614392094]
[null,null,null,null,null,null,null,null,null,null,null,null,null,null,null,null,null,null,null,null,null,null,null,null,null,null,null,null,1.3000000000000004E-3,3.2117849121416318,-10.121675053913439]
["Developed by Prof. Douglas A. Vander Griend, Calvin College, Grand Rapids, MI",null,null,null,null,null,null,null,null,null,null,null,null,null,null,null,null,null,null,null,null,null,null,null,null,null,null,null,1.4000000000000004E-3,3.5208220659816125,-10.471442319899937]
[null,null,null,null,null,null,null,null,null,null,null,null,null,null,null,null,null,null,null,null,null,null,null,null,null,null,null,null,1.5000000000000005E-3,3.8408304498269894,-10.778448301739079]
[null,null,null,null,null,null,null,null,null,null,null,null,null,null,null,null,null,null,null,null,null,null,null,null,null,null,null,null,1.6000000000000005E-3,4.172335600907032,-11.042218927556252]
[null,null,null,null,null,null,null,null,null,null,null,null,null,null,null,null,null,null,null,null,null,null,null,null,null,null,null,null,1.7000000000000006E-3,4.5158949049208896,-11.261943447107077]
[null,null,null,null,null,null,null,null,null,null,null,null,null,null,null,null,null,null,null,null,null,null,null,null,null,null,null,null,1.8000000000000006E-3,4.8720999405116023,-11.4364980761691]
[null,null,null,null,null,null,null,null,null,null,null,null,null,null,null,null,null,null,null,null,null,null,null,null,null,null,null,null,1.9000000000000006E-3,5.2415790275872594,-11.564460268978932]
[null,null,null,null,null,null,null,null,null,null,null,null,null,null,null,null,null,null,null,null,null,null,null,null,null,null,null,null,2.0000000000000005E-3,5.6250000000000009,-11.644115687342255]
[null,null,null,null,null,null,null,null,null,null,null,null,null,null,null,null,null,null,null,null,null,null,null,null,null,null,null,null,2.1000000000000003E-3,6.0230732254446391,-11.673459249596602]
[null,null,null,null,null,null,null,null,null,null,null,null,null,null,null,null,null,null,null,null,null,null,null,null,null,null,null,null,2.2000000000000001E-3,6.4365548980933616,-11.650191180892648]
[null,null,null,null,null,null,null,null,null,null,null,null,null,null,null,null,null,null,null,null,null,null,null,null,null,null,null,null,2.3E-3,6.8662506324843982,-11.571708664931753]
[null,null,null,null,null,null,null,null,null,null,null,null,null,null,null,null,null,null,null,null,null,null,null,null,null,null,null,null,2.3999999999999998E-3,7.313019390581716,-11.435093465740813]
[null,null,null,null,null,null,null,null,null,null,null,null,null,null,null,null,null,null,null,null,null,null,null,null,null,null,null,null,2.4999999999999996E-3,7.7777777777777741,-11.237095714609449]
[null,null,null,null,null,null,null,null,null,null,null,null,null,null,null,null,null,null,null,null,null,null,null,null,null,null,null,null,2.5999999999999994E-3,8.261504747991232,-10.974113921555624]
[null,null,null,null,null,null,null,null,null,null,null,null,null,null,null,null,null,null,null,null,null,null,null,null,null,null,null,null,2.6999999999999993E-3,8.7652467629949307,-10.642171159071562]
[null,null,null,null,null,null,null,null,null,null,null,null,null,null,null,null,null,null,null,null,null,null,null,null,null,null,null,null,2.7999999999999991E-3,9.2901234567901145,-10.236887269124903]
[null,null,null,null,null,null,null,null,null,null,null,null,null,null,null,null,null,null,null,null,null,null,null,null,null,null,null,null,2.8999999999999989E-3,9.8373338623288955,-9.7534468557954597]
[null,null,null,null,null,null,null,null,null,null,null,null,null,null,null,null,null,null,null,null,null,null,null,null,null,null,null,null,2.9999999999999988E-3,10.408163265306115,-9.1865627405245736]
[null,null,null,null,null,null,null,null,null,null,null,null,null,null,null,null,null,null,null,null,null,null,null,null,null,null,null,null,3.0999999999999986E-3,{"$f":"IF($AB$5=1,$C$2/($I$5+$F$5+$C$5+($H$4-$E$4-$B$4)*AC46),(0.08205821*$AB$9)/$C$2)^($H$4-$E$4-$B$4)*($I$5+$H$4*AC46)^$H$4/($C$5-$B$4*AC46)^$B$4/($F$5-$E$4*AC46)^$E$4","v":11.003990758244056},-8.5304344707700306]
[null,null,null,null,null,null,null,null,null,null,null,null,null,null,null,null,null,null,null,null,null,null,null,null,null,null,null,null,3.1999999999999984E-3,11.626297577854658,-7.7787013825157478]
[null,null,null,null,null,null,null,null,null,null,null,null,null,null,null,null,null,null,null,null,null,null,null,null,null,null,null,null,3.2999999999999982E-3,12.27667631989306,-6.9243896194917758]
[null,null,null,null,null,null,null,null,null,null,null,null,null,null,null,null,null,null,null,null,null,null,null,null,null,null,null,null,3.3999999999999981E-3,12.956841138659307,-5.9598524040919045]
[null,null,null,null,null,null,null,null,null,null,null,null,null,null,null,null,null,null,null,null,null,null,null,null,null,null,null,null,3.4999999999999979E-3,13.668639053254422,-4.876702733690693]
[null,null,null,null,null,null,null,null,null,null,null,null,null,null,null,null,null,null,null,null,null,null,null,null,null,null,null,null,3.5999999999999977E-3,14.414062499999979,-3.6657375379377757]
[null,null,null,null,null,null,null,null,null,null,null,null,null,null,null,null,null,null,null,null,null,null,null,null,null,null,null,null,3.6999999999999976E-3,15.195263290501368,-2.3168521737881456]
[null,null,null,null,null,null,null,null,null,null,null,null,null,null,null,null,null,null,null,null,null,null,null,null,null,null,null,null,3.7999999999999974E-3,16.014568158168554,-0.81894395105753359]
[null,null,null,null,null,null,null,null,null,null,null,null,null,null,null,null,null,null,null,null,null,null,null,null,null,null,null,null,3.8999999999999972E-3,16.874496103198041,0.84019683306668136]
[null,null,null,null,null,null,null,null,null,null,null,null,null,null,null,null,null,null,null,null,null,null,null,null,null,null,null,null,3.9999999999999975E-3,17.777777777777754,2.6740101231090012]
[null,null,null,null,null,null,null,null,null,null,null,null,null,null,null,null,null,null,null,null,null,null,null,null,null,null,null,null,4.0999999999999977E-3,18.727377190462487,4.6973056656227845]
[null,null,null,null,null,null,null,null,null,null,null,null,null,null,null,null,null,null,null,null,null,null,null,null,null,null,null,null,4.199999999999998E-3,19.72651605231864,6.9264213166279749]
[null,null,null,null,null,null,null,null,null,null,null,null,null,null,null,null,null,null,null,null,null,null,null,null,null,null,null,null,4.2999999999999983E-3,20.778701138811922,9.3794029244687422]
[null,null,null,null,null,null,null,null,null,null,null,null,null,null,null,null,null,null,null,null,null,null,null,null,null,null,null,null,4.3999999999999985E-3,21.887755102040799,12.076209106410239]
[null,null,null,null,null,null,null,null,null,null,null,null,null,null,null,null,null,null,null,null,null,null,null,null,null,null,null,null,4.4999999999999988E-3,23.057851239669404,15.038944821418417]
[null,null,null,null,null,null,null,null,null,null,null,null,null,null,null,null,null,null,null,null,null,null,null,null,null,null,null,null,4.5999999999999991E-3,24.293552812071315,18.292128340113994]
[null,null,null,null,null,null,null,null,null,null,null,null,null,null,null,null,null,null,null,null,null,null,null,null,null,null,null,null,4.6999999999999993E-3,25.599857600569582,21.862997050999841]
[null,null,null,null,null,null,null,null,null,null,null,null,null,null,null,null,null,null,null,null,null,null,null,null,null,null,null,null,4.7999999999999996E-3,26.982248520710048,25.781858550935326]
[null,null,null,null,null,null,null,null,null,null,null,null,null,null,null,null,null,null,null,null,null,null,null,null,null,null,null,null,4.8999999999999998E-3,28.446751249519409,30.08249468638008]
[null,null,null,null,null,null,null,null,null,null,null,null,null,null,null,null,null,null,null,null,null,null,null,null,null,null,null,null,5.0000000000000001E-3,30,34.802627688852844]
[null,null,null,null,null,null,null,null,null,null,null,null,null,null,null,null,null,null,null,null,null,null,null,null,null,null,null,null,5.1000000000000004E-3,31.649312786339024,39.984459344561124]
[null,null,null,null,null,null,null,null,null,null,null,null,null,null,null,null,null,null,null,null,null,null,null,null,null,null,null,null,5.2000000000000006E-3,33.402777777777786,45.675296331526994]
[null,null,null,null,null,null,null,null,null,null,null,null,null,null,null,null,null,null,null,null,null,null,null,null,null,null,null,null,5.3000000000000009E-3,35.269352648257147,51.92827754573792]
[null,null,null,null,null,null,null,null,null,null,null,null,null,null,null,null,null,null,null,null,null,null,null,null,null,null,null,null,5.4000000000000012E-3,37.258979206049169,58.803222545698965]
[null,null,null,null,null,null,null,null,null,null,null,null,null,null,null,null,null,null,null,null,null,null,null,null,null,null,null,null,5.5000000000000014E-3,39.382716049382744,66.36762433198524]
[null,null,null,null,null,null,null,null,null,null,null,null,null,null,null,null,null,null,null,null,null,null,null,null,null,null,null,null,5.6000000000000017E-3,41.652892561983506,74.697814750468453]
[null,null,null,null,null,null,null,null,null,null,null,null,null,null,null,null,null,null,null,null,null,null,null,null,null,null,null,null,5.7000000000000019E-3,44.083288263926491,83.880337130480271]
[null,null,null,null,null,null,null,null,null,null,null,null,null,null,null,null,null,null,null,null,null,null,null,null,null,null,null,null,5.8000000000000022E-3,46.689342403628181,94.013568687631988]
[null,null,null,null,null,null,null,null,null,null,null,null,null,null,null,null,null,null,null,null,null,null,null,null,null,null,null,null,5.9000000000000025E-3,49.488399762046463,105.20964518681573]
[null,null,null,null,null,null,null,null,null,null,null,null,null,null,null,null,null,null,null,null,null,null,null,null,null,null,null,null,6.0000000000000027E-3,52.500000000000078,117.59675296775927]
[null,null,null,null,null,null,null,null,null,null,null,null,null,null,null,null,null,null,null,null,null,null,null,null,null,null,null,null,6.100000000000003E-3,55.746219592373535,131.3218694689109]
[null,null,null,null,null,null,null,null,null,null,null,null,null,null,null,null,null,null,null,null,null,null,null,null,null,null,null,null,6.2000000000000033E-3,59.252077562326974,146.55405389143974]
[null,null,null,null,null,null,null,null,null,null,null,null,null,null,null,null,null,null,null,null,null,null,null,null,null,null,null,null,6.3000000000000035E-3,{"$f":"IF($AB$5=1,$C$2/($I$5+$F$5+$C$5+($H$4-$E$4-$B$4)*AC78),(0.08205821*$AB$9)/$C$2)^($H$4-$E$4-$B$4)*($I$5+$H$4*AC78)^$H$4/($C$5-$B$4*AC78)^$B$4/($F$5-$E$4*AC78)^$E$4","v":63.046018991965063},163.48841602609474]
[null,null,null,null,null,null,null,null,null,null,null,null,null,null,null,null,null,null,null,null,null,null,null,null,null,null,null,null,6.4000000000000038E-3,67.160493827160664,182.35092541501226]
[null,null,null,null,null,null,null,null,null,null,null,null,null,null,null,null,null,null,null,null,null,null,null,null,null,null,null,null,6.500000000000004E-3,71.632653061224673,203.40426751377197]
[null,null,null,null,null,null,null,null,null,null,null,null,null,null,null,null,null,null,null,null,null,null,null,null,null,null,null,null,6.6000000000000043E-3,76.505190311418886,226.95501188678062]
[null,null,null,null,null,null,null,null,null,null,null,null,null,null,null,null,null,null,null,null,null,null,null,null,null,null,null,null,{"$f":"(MIN($C$5/$B$4,$F$5/$E$4)+$I$5/$H$4)/100+AC81","v":6.7000000000000046E-3},81.827364554637512,{"$f":"0.00831451*$AB$9*AD82*(LN(AD82/$AE$11)-1)/$AE$11","v":253.36243459160244}]
[null,null,null,null,null,null,null,null,null,null,null,null,null,null,null,null,null,null,null,null,null,null,null,null,null,null,null,null,6.8000000000000048E-3,87.656250000000284,283.04943958937446]
[null,null,null,null,null,null,null,null,null,null,null,null,null,null,null,null,null,null,null,null,null,null,null,null,null,null,null,null,6.9000000000000051E-3,94.05827263267463,316.51616183300268]
[null,null,null,null,null,null,null,null,null,null,null,null,null,null,null,null,null,null,null,null,null,null,null,null,null,null,null,null,7.0000000000000053E-3,101.1111111111115,354.35702123507764]
[null,null,null,null,null,null,null,null,null,null,null,null,null,null,null,null,null,null,null,null,null,null,null,null,null,null,null,null,7.1000000000000056E-3,108.90606420927513,397.28225152908533]
[null,null,null,null,null,null,null,null,null,null,null,null,null,null,null,null,null,null,null,null,null,null,null,null,null,null,null,null,7.2000000000000059E-3,117.55102040816379,446.14527944545915]
[null,null,null,null,null,null,null,null,null,null,null,null,null,null,null,null,null,null,null,null,null,null,null,null,null,null,null,null,7.3000000000000061E-3,127.17421124828593,501.97781922601553]
[null,null,null,null,null,null,null,null,null,null,null,null,null,null,null,null,null,null,null,null,null,null,null,null,null,null,null,null,7.4000000000000064E-3,137.92899408284092,566.03523712312324]
[null,null,null,null,null,null,null,null,null,null,null,null,null,null,null,null,null,null,null,null,null,null,null,null,null,null,null,null,7.5000000000000067E-3,150.00000000000082,639.85572328643866]
[null,null,null,null,null,null,null,null,null,null,null,null,null,null,null,null,null,null,null,null,null,null,null,null,null,null,null,null,7.6000000000000069E-3,163.61111111111211,725.33822655298434]
[null,null,null,null,null,null,null,null,null,null,null,null,null,null,null,null,null,null,null,null,null,null,null,null,null,null,null,null,7.7000000000000072E-3,179.03591682419773,824.84618167395865]
[null,null,null,null,null,null,null,null,null,null,null,null,null,null,null,null,null,null,null,null,null,null,null,null,null,null,null,null,7.8000000000000074E-3,196.61157024793519,941.34713605862589]
[null,null,null,null,null,null,null,null,null,null,null,null,null,null,null,null,null,null,null,null,null,null,null,null,null,null,null,null,7.9000000000000077E-3,216.75736961451406,1078.6030218260203]
[null,null,null,null,null,null,null,null,null,null,null,null,null,null,null,null,null,null,null,null,null,null,null,null,null,null,null,null,8.0000000000000071E-3,240.00000000000168,1241.4329305212575]
[null,null,null,null,null,null,null,null,null,null,null,null,null,null,null,null,null,null,null,null,null,null,null,null,null,null,null,null,8.1000000000000065E-3,267.00831024930932,1436.0813539386186]
[null,null,null,null,null,null,null,null,null,null,null,null,null,null,null,null,null,null,null,null,null,null,null,null,null,null,null,null,8.2000000000000059E-3,298.64197530864391,1670.7425526833777]
[null,null,null,null,null,null,null,null,null,null,null,null,null,null,null,null,null,null,null,null,null,null,null,null,null,null,null,null,8.3000000000000053E-3,336.02076124567685,1956.3205493381622]
[null,null,null,null,null,null,null,null,null,null,null,null,null,null,null,null,null,null,null,null,null,null,null,null,null,null,null,null,8.4000000000000047E-3,380.62500000000216,2307.552386122421]
[null,null,null,null,null,null,null,null,null,null,null,null,null,null,null,null,null,null,null,null,null,null,null,null,null,null,null,null,8.5000000000000041E-3,434.44444444444673,2744.7048737520095]
[null,null,null,null,null,null,null,null,null,null,null,null,null,null,null,null,null,null,null,null,null,null,null,null,null,null,null,null,8.6000000000000035E-3,500.2040816326554,3296.2010776784391]
[null,null,null,null,null,null,null,null,null,null,null,null,null,null,null,null,null,null,null,null,null,null,null,null,null,null,null,null,8.7000000000000029E-3,581.71597633136332,4002.7998691153562]
[null,null,null,null,null,null,null,null,null,null,null,null,null,null,null,null,null,null,null,null,null,null,null,null,null,null,null,null,8.8000000000000023E-3,684.44444444444684,4924.4594933160752]
[null,null,null,null,null,null,null,null,null,null,null,null,null,null,null,null,null,null,null,null,null,null,null,null,null,null,null,null,8.9000000000000017E-3,816.44628099173758,6152.0241189642074]
[null,null,null,null,null,null,null,null,null,null,null,null,null,null,null,null,null,null,null,null,null,null,null,null,null,null,null,null,9.0000000000000011E-3,990.00000000000171,7827.9776784231217]
[null,null,null,null,null,null,null,null,null,null,null,null,null,null,null,null,null,null,null,null,null,null,null,null,null,null,null,null,9.1000000000000004E-3,1224.5679012345686,10185.173599396379]
[null,null,null,null,null,null,null,null,null,null,null,null,null,null,null,null,null,null,null,null,null,null,null,null,null,null,null,null,9.1999999999999998E-3,1552.4999999999984,13623.529930612131]
[null,null,null,null,null,null,null,null,null,null,null,null,null,null,null,null,null,null,null,null,null,null,null,null,null,null,null,null,9.2999999999999992E-3,2030.8163265306064,18873.317229796488]
[null,null,null,null,null,null,null,null,null,null,null,null,null,null,null,null,null,null,null,null,null,null,null,null,null,null,null,null,9.3999999999999986E-3,2767.7777777777633,27375.784773214815]
[null,null,null,null,null,null,null,null,null,null,null,null,null,null,null,null,null,null,null,null,null,null,null,null,null,null,null,null,9.499999999999998E-3,{"$f":"IF($AB$5=1,$C$2/($I$5+$F$5+$C$5+($H$4-$E$4-$B$4)*AC110),(0.08205821*$AB$9)/$C$2)^($H$4-$E$4-$B$4)*($I$5+$H$4*AC110)^$H$4/($C$5-$B$4*AC110)^$B$4/($F$5-$E$4*AC110)^$E$4","v":3989.9999999999654},42280.611728742857]
[null,null,null,null,null,null,null,null,null,null,null,null,null,null,null,null,null,null,null,null,null,null,null,null,null,null,null,null,9.5999999999999974E-3,6239.9999999999136,71507.611220231949]
[null,null,null,null,null,null,null,null,null,null,null,null,null,null,null,null,null,null,null,null,null,null,null,null,null,null,null,null,9.6999999999999968E-3,11101.11111111086,139553.67245391844]
[null,null,null,null,null,null,null,null,null,null,null,null,null,null,null,null,null,null,null,null,null,null,null,null,null,null,null,null,9.7999999999999962E-3,24989.999999999,353281.23178656714]
[null,null,null,null,null,null,null,null,null,null,null,null,null,null,null,null,null,null,null,null,null,null,null,null,null,null,null,null,9.8999999999999956E-3,99989.999999990803,1681083.4895351254]
[null,null,null,null,null,null,null,null,null,null,null,null,null,null,null,null,null,null,null,null,null,null,null,null,null,null,null,null,{"$f":"MIN($C$5/$B$4,$F$5/$E$4)-(MIN($C$5/$B$4,$F$5/$E$4)+$I$5/$H$4)/250","v":9.9600000000000001E-3},624989.99999999674,{"$f":"0.00831451*$AB$9*AD115*(LN(AD115/$AE$11)-1)/$AE$11","v":12717846.279415837}]
[null,null,null,null,null,null,null,null,null,null,null,null,null,null,null,null,null,null,null,null,null,null,null,null,null,null,null,null,{"$f":"MIN($C$5/$B$4,$F$5/$E$4)-(MIN($C$5/$B$4,$F$5/$E$4)+$I$5/$H$4)/1000","v":9.9900000000000006E-3},9999990.0000008158,{"$f":"0.00831451*$AB$9*AD116*(LN(AD116/$AE$11)-1)/$AE$11","v":256989490.36009282}]

{"sheet":"Modifiable","index":5,"n_rows":116,"n_cols":33,"rows_kept":116,"cut":false,"hidden":false,"merged":[]}
[]
[{"$f":"IF($AD$5=1,\"Pressure:\",\"Volume:\")","v":"Pressure:"},null,3,{"$f":"IF($AD$5=1,IF($AD$5=1,\"atm\",\"bar\"),\"L\")","v":"atm"},null,null,null,null,null,null,null,null,null,null,null,null,null,null,null,null,null,null,null,null,null,null,null,null,null,1,"Celsius","A=",5]
["Temperature:",null,{"$f":"$AD$9-273*IF($AD$2=1,1,0)","v":1296},{"$f":"IF(AD2=1,\"C\",\"K\")","v":"C"},null,null,null,null,null,null,null,null,null,null,null,null,null,null,null,null,null,null,null,null,null,null,null,null,null,null,"Kelvin"]
["Reaction:",1,"A","+",0,"B",null,2,"C","+",0,"D",null,null,null,null,null,null,null,null,null,null,null,null,null,null,null,null,null,{"$f":"VLOOKUP($AG$11,$AE$13:$AG$116,3)/$AG$11/10000","v":5.3893143168699809E-3},"Equilibrium Sensitivity","B=",0]
["initial (moles):",null,1,null,null,1,null,null,0,null,null,2,"Units:",null,null,null,null,null,null,null,null,null,null,null,null,null,null,null,null,1,"Constant Pressure","C=",0]
[{"$f":"IF($AD$7=1,\"initial (atm):\",\"initial (M):\")","v":"initial (atm):"},null,{"$f":"IF($AD$5=1,$C$2*C5/SUM($C$5:$L$5),0.08205821*$AD$9*C5/$C$2)/(0.08205821*$AD$9)^($AD$7-1)","v":0.75},null,null,{"$f":"IF($AD$5=1,$C$2*F5/SUM($C$5:$L$5),0.08205821*$AD$9*F5/$C$2)/(0.08205821*$AD$9)^($AD$7-1)","v":0.75},null,null,{"$f":"IF($AD$5=1,$C$2*I5/SUM($C$5:$L$5),0.08205821*$AD$9*I5/$C$2)/(0.08205821*$AD$9)^($AD$7-1)","v":0},null,null,{"$f":"IF($AD$5=1,$C$2*L5/SUM($C$5:$L$5),0.08205821*$AD$9*L5/$C$2)/(0.08205821*$AD$9)^($AD$7-1)","v":1.5},{"$f":"IF($AD$7=1,\"Qpi = \",\"Qci = \")","v":"Qpi = "},{"$f":"IF(C5*F5=0,\"∞\",(I6^$H$4)*(L6^$K$4)/(F6)^$E$4/(C6)^$B$4)","v":0},null,"Initial Reaction Quotient",null,null,null,null,null,null,null,null,null,null,null,null,null,null,"Constant Volume","D=",0]
["change (moles):",null,{"$f":"-N7*B4","v":-0.98436614553818458},null,null,{"$f":"-E4*N7","v":0},null,null,{"$f":"H4*N7","v":1.9687322910763692},null,null,{"$f":"K4*N7","v":0},"x =",{"$f":"-MIN(IF($H$4=0,$L$5/$K$4,$I$5/$H$4),IF($K$4=0,$I$5/$H$4,$L$5/$K$4))+($AD$11/29999)*(MIN(IF($B$4=0,$F$5/$E$4,$C$5/$B$4),IF($E$4=0,$C$5/$B$4,$F$5/$E$4))+MIN(IF($H$4=0,$L$5/$K$4,$I$5/$H$4),IF($K$4=0,$I$5/$H$4,$L$5/$K$4)))","v":0.98436614553818458},"mol","Extent of Reaction",null,null,null,null,null,null,null,null,null,null,null,null,null,1,"Atmospheres","E=",0]
[{"$f":"IF(ABS(N9/N10-1)<AD4,\"equilibrium (moles):\",\"equilibrating ... (moles):\")","v":"equilibrating ... (moles):"},null,{"$f":"C7+C5","v":1.5633854461815422E-2},null,null,{"$f":"F7+F5","v":1},null,null,{"$f":"I7+I5","v":1.9687322910763692},null,null,{"$f":"L5+L7","v":2},null,null,null,null,null,null,null,null,null,null,null,null,null,null,null,null,null,null,"Molarity","F=",0]
[{"$f":"IF(ABS(N9/N10-1)<AD4,IF($AD$7=1,\"equilibrium (atm):\",\"equilibrium (M)\"),IF($AD$7=1,\"equilibrating ... (atm):\",\"equilibrating…(M)\"))","v":"equilibrating ... (atm):"},null,{"$f":"IF($AD$5=1,$C$2*(C5+C7)/SUM($C$5:$L$5,$C$7:$L$7),(C5+C7)*0.08205821*$AD$9/$C$2)/(0.08205821*$AD$9)^($AD$7-1)","v":9.4097347618474544E-3},null,null,{"$f":"IF($AD$5=1,$C$2*(F5+F7)/SUM($C$5:$L$5,$C$7:$L$7),(F5+F7)*0.08205821*$AD$9/$C$2)/(0.08205821*$AD$9)^($AD$7-1)","v":0.60188194695236952},null,null,{"$f":"IF($AD$5=1,$C$2*(I5+I7)/SUM($C$5:$L$5,$C$7:$L$7),(I5+I7)*0.08205821*$AD$9/$C$2)/(0.08205821*$AD$9)^($AD$7-1)","v":1.1849444243810441},null,null,{"$f":"IF($AD$5=1,$C$2*(L5+L7)/SUM($C$5:$L$5,$C$7:$L$7),(L5+L7)*0.08205821*$AD$9/$C$2)/(0.08205821*$AD$9)^($AD$7-1)","v":1.203763893904739},{"$f":"IF($AD$7=1,\"Qp = \",\"Qc = \")","v":"Qp = "},{"$f":"(I9^H4)*(L9^K4)/(C9^B4)/(F9^E4)","v":149.21709531757855},null,"Reaction Quotient",null,null,null,null,null,null,null,null,null,null,null,null,null,1569,"Temperature (k)","lnK =",{"$f":"AG2+AG4/AD9+AG5*LN(AD9)+AG6*AD9+AG7*AD9^2+AG8*AD9^3","v":5}]
[null,null,null,null,null,null,null,null,null,null,null,null,{"$f":"IF($AD$7=1,\"Kp = \",\"Kc = \")","v":"Kp = "},{"$f":"IF($AD$7=1,$AG$11,$AG$11*(0.08205821*$AD$9)^(E4+B4-H4))","v":148.4131591025766},null,"Equilibrium Constant",null,null,null,null,null,null,null,null,null,null,null,null,null,null,null,null," (LnK = A + B/T +ClnK + DT + ET^2 + FT^3)"]
[{"$f":"IF(ABS($N$9/$N$10-1)<AD4,\"\",IF($N$9>$N$10,\"¬\",\"®\"))","v":"¬"},null,{"$f":"IF(ABS(N9/N10-1)<AD4,\"Equilibrium!\",IF(N9>N10,\"Too far.\",\"Not far enough…\"))","v":"Too far."},null,null,null,null,null,{"$f":"IF(ABS($N$9/$N$10-1)<AD4,\"\",IF($N$9>$N$10,\"¬\",\"®\"))","v":"¬"},null,null,null,"G =",{"$f":"0.00831451*$AD$9*N9*(LN(N9/N10)-1)/N10","v":-13.045275140804657},"kJ","Gibb's Free Energy",null,null,null,null,null,null,null,null,null,null,null,null,null,29530,"Slider Position","Kp =",{"$f":"EXP(AG9)","v":148.4131591025766}]
[null,null,null,null,null,null,null,null,null,null,null,null,"ΔG =",{"$f":"0.00831451*$AD$9*LN(N9/N10)","v":7.0475014300259792E-2},"kJ/mol",null,null,null,null,null,null,null,null,null,null,null,null,null,null,"x","Qp","G"]
[null,null,null,null,null,null,null,null,null,null,null,null,null,null,null,null,null,null,null,null,null,null,null,null,null,null,null,null,null,{"$f":"-MIN(IF($H$4=0,$L$5/$K$4,$I$5/$H$4),IF($K$4=0,$I$5/$H$4,$L$5/$K$4))","v":0},0,0,{"$f":"(AE14-AE13)/(AD14-AD13)","v":3.0022524398930295E-3}]
[null,null,null,null,null,null,null,null,null,null,null,null,null,null,null,null,null,null,null,null,null,null,null,null,null,null,null,null,null,{"$f":"(MIN(IF($B$4=0,$F$5/$E$4,$C$5/$B$4),IF($E$4=0,$C$5/$B$4,$F$5/$E$4))+MIN(IF($H$4=0,$L$5/$K$4,$I$5/$H$4),IF($K$4=0,$I$5/$H$4,$L$5/$K$4)))/1000+AD13","v":1E-3},{"$f":"IF($AD$5=1,$C$2/($I$5+$F$5+$C$5+$L$5+($H$4+$K$4-$E$4-$B$4)*AD14),(0.08205821*$AD$9)/$C$2)^($H$4+$K$4-$E$4-$B$4)*($I$5+$H$4*AD14)^$H$4*($L$5+$K$4*AD14)^$K$4/($C$5-$B$4*AD14)^$B$4/($F$5-$E$4*AD14)^$E$4","v":3.0022524398930294E-6},{"$f":"0.00831451*$AD$9*AE14*(LN(AE14/$AG$11)-1)/$AG$11","v":-4.9391346406235257E-6},{"$f":"(AE15-AE13)/(AD15-AD13)","v":1.2036156614469868E-2}]
[null,null,null,null,null,null,null,null,null,null,null,null,null,null,null,null,null,null,null,null,null,null,null,null,null,null,null,null,null,{"$f":"(MIN(IF($B$4=0,$F$5/$E$4,$C$5/$B$4),IF($E$4=0,$C$5/$B$4,$F$5/$E$4))+MIN(IF($H$4=0,$L$5/$K$4,$I$5/$H$4),IF($K$4=0,$I$5/$H$4,$L$5/$K$4)))/250+AD13","v":4.0000000000000001E-3},{"$f":"IF($AD$5=1,$C$2/($I$5+$F$5+$C$5+$L$5+($H$4+$K$4-$E$4-$B$4)*AD15),(0.08205821*$AD$9)/$C$2)^($H$4+$K$4-$E$4-$B$4)*($I$5+$H$4*AD15)^$H$4*($L$5+$K$4*AD15)^$K$4/($C$5-$B$4*AD15)^$B$4/($F$5-$E$4*AD15)^$E$4","v":4.8144626457879473E-5},-6.7461932593736187E-5,{"$f":"(AE16-AE14)/(AD16-AD14)","v":3.3252484894354145E-2}]
[null,null,null,null,null,null,null,null,null,null,null,null,null,null,null,null,null,null,null,null,null,null,null,null,null,null,null,null,null,{"$f":"(MIN(IF($B$4=0,$F$5/$E$4,$C$5/$B$4),IF($E$4=0,$C$5/$B$4,$F$5/$E$4))+MIN(IF($H$4=0,$L$5/$K$4,$I$5/$H$4),IF($K$4=0,$I$5/$H$4,$L$5/$K$4)))/100+AD13","v":0.01},3.0227461648908038E-4,-3.7474560600292086E-4,7.3140823776629268E-2]
[null,null,null,null,null,null,null,null,null,null,null,null,null,null,null,null,null,null,null,null,null,null,null,null,null,null,null,null,null,{"$f":"(MIN(IF($B$4=0,$F$5/$E$4,$C$5/$B$4),IF($E$4=0,$C$5/$B$4,$F$5/$E$4))+MIN(IF($H$4=0,$L$5/$K$4,$I$5/$H$4),IF($K$4=0,$I$5/$H$4,$L$5/$K$4)))/100+AD16","v":0.02},1.2183978068839479E-3,-1.3612231333108031E-3,0.12302548280528174]
[null,null,null,null,null,null,null,null,null,null,null,null,null,null,null,null,null,null,null,null,null,null,null,null,null,null,null,null,null,{"$f":"(MIN(IF($B$4=0,$F$5/$E$4,$C$5/$B$4),IF($E$4=0,$C$5/$B$4,$F$5/$E$4))+MIN(IF($H$4=0,$L$5/$K$4,$I$5/$H$4),IF($K$4=0,$I$5/$H$4,$L$5/$K$4)))/100+AD17","v":0.03},2.7627842725947145E-3,-2.8878285464534088E-3,0.18660486213105013]
[null,null,null,null,null,null,null,null,null,null,null,null,null,null,null,null,null,null,null,null,null,null,null,null,null,null,null,null,null,0.04,4.9504950495049506E-3,-4.9207568472821239E-3,0.25172433412854894]
[null,null,null,null,null,null,null,null,null,null,null,null,null,null,null,null,null,null,null,null,null,null,null,null,null,null,null,null,null,0.05,7.7972709551656942E-3,-7.4390743045680092E-3,0.31845365649655855]
[null,null,null,null,null,null,null,null,null,null,null,null,null,null,null,null,null,null,null,null,null,null,null,null,null,null,null,null,null,6.0000000000000005E-2,1.1319568179436123E-2,-1.0428671513756389E-2,0.38686626122958884]
[null,null,null,null,null,null,null,null,null,null,null,null,null,null,null,null,null,null,null,null,null,null,null,null,null,null,null,null,null,7.0000000000000007E-2,1.5534596179757472E-2,-1.3879733201478339E-2,0.45703949384149306]
[null,null,null,null,null,null,null,null,null,null,null,null,null,null,null,null,null,null,null,null,null,null,null,null,null,null,null,null,null,0.08,2.0460358056265983E-2,-1.778543464655287E-2,0.52905487087993608]
[null,null,null,null,null,null,null,null,null,null,null,null,null,null,null,null,null,null,null,null,null,null,null,null,null,null,null,null,null,0.09,2.6115693597356188E-2,-2.2141184213254089E-2,0.60299835734930263]
[null,null,null,null,null,null,null,null,null,null,null,null,null,null,null,null,null,null,null,null,null,null,null,null,null,null,null,null,null,9.9999999999999992E-2,3.2520325203252029E-2,-2.6944147105431585E-2,0.6789606658223406]
[null,null,null,null,null,null,null,null,null,null,null,null,null,null,null,null,null,null,null,null,null,null,null,null,null,null,null,null,null,0.10999999999999999,3.9694906913802994E-2,-3.2192929055808603E-2,0.75703757920191739]
[null,null,null,null,null,null,null,null,null,null,null,null,null,null,null,null,null,null,null,null,null,null,null,null,null,null,null,null,null,0.11999999999999998,4.7661076787290368E-2,-3.7887357887685533E-2,0.83733029929607383]
[null,null,null,null,null,null,null,null,null,null,null,null,null,null,null,null,null,null,null,null,null,null,null,null,null,null,null,null,null,0.12999999999999998,5.6441512899724461E-2,-4.4028328488455462E-2,0.91994582359469901]
["Developed by Prof. Douglas A. Vander Griend, Calvin College, Grand Rapids, MI",null,null,null,null,null,null,null,null,null,null,null,null,null,null,null,null,null,null,null,null,null,null,null,null,null,null,null,null,0.13999999999999999,6.6059993259184352E-2,-5.0617690822193181E-2,1.0049973528876237]
[null,null,null,null,null,null,null,null,null,null,null,null,null,null,null,null,null,null,null,null,null,null,null,null,null,null,null,null,null,0.15,7.6541459957476951E-2,-5.7658168325152435E-2,1.0926047326451773]
[null,null,null,null,null,null,null,null,null,null,null,null,null,null,null,null,null,null,null,null,null,null,null,null,null,null,null,null,null,0.16,8.7912087912087919E-2,-6.5153298501891513E-2,1.1828949313971933]
[null,null,null,null,null,null,null,null,null,null,null,null,null,null,null,null,null,null,null,null,null,null,null,null,null,null,null,null,null,0.17,0.10019935858542084,-7.3107390258340579E-2,1.2760025596996081]
[null,null,null,null,null,null,null,null,null,null,null,null,null,null,null,null,null,null,null,null,null,null,null,null,null,null,null,null,null,0.18000000000000002,0.1134321391060801,-8.1525494227078957E-2,1.3720704336742442]
[null,null,null,null,null,null,null,null,null,null,null,null,null,null,null,null,null,null,null,null,null,null,null,null,null,null,null,null,null,0.19000000000000003,0.12764076725890575,-9.0413383465007824E-2,1.4712501875531387]
[null,null,null,null,null,null,null,null,null,null,null,null,null,null,null,null,null,null,null,null,null,null,null,null,null,null,null,null,null,0.20000000000000004,0.1428571428571429,-9.9777542662541227E-2,1.5737029401606428]
[null,null,null,null,null,null,null,null,null,null,null,null,null,null,null,null,null,null,null,null,null,null,null,null,null,null,null,null,null,0.21000000000000005,0.15911482606211863,-0.10962516452984808,1.6796000208322504]
[null,null,null,null,null,null,null,null,null,null,null,null,null,null,null,null,null,null,null,null,null,null,null,null,null,null,null,null,null,0.22000000000000006,0.17644914327378794,-0.11996415240039662,1.7891237609080732]
[null,null,null,null,null,null,null,null,null,null,null,null,null,null,null,null,null,null,null,null,null,null,null,null,null,null,null,null,null,0.23000000000000007,0.19489730128028013,-0.13080312836559699,1.9024683576611547]
[null,null,null,null,null,null,null,null,null,null,null,null,null,null,null,null,null,null,null,null,null,null,null,null,null,null,null,null,null,0.24000000000000007,0.21449851042701107,-0.14215144645912556,2.0198408183389427]
[null,null,null,null,null,null,null,null,null,null,null,null,null,null,null,null,null,null,null,null,null,null,null,null,null,null,null,null,null,0.25000000000000006,0.23529411764705896,-0.15401921056691764,2.141461992924294]
[null,null,null,null,null,null,null,null,null,null,null,null,null,null,null,null,null,null,null,null,null,null,null,null,null,null,null,null,null,0.26000000000000006,0.25732775028549693,-0.16641729686322659,2.2675677052765817]
[null,null,null,null,null,null,null,null,null,null,null,null,null,null,null,null,null,null,null,null,null,null,null,null,null,null,null,null,null,0.27000000000000007,0.28064547175259064,-0.1793573806745154,2.398409993513321]
[null,null,null,null,null,null,null,null,null,null,null,null,null,null,null,null,null,null,null,null,null,null,null,null,null,null,null,null,null,0.28000000000000008,0.30529595015576338,-0.19285196775828664,2.5342584718602823]
[null,null,null,null,null,null,null,null,null,null,null,null,null,null,null,null,null,null,null,null,null,null,null,null,null,null,null,null,null,0.29000000000000009,0.33133064118979633,-0.2069144300583533,2.675401827760016]
[null,null,null,null,null,null,null,null,null,null,null,null,null,null,null,null,null,null,null,null,null,null,null,null,null,null,null,null,null,0.3000000000000001,0.35880398671096375,-0.22155904606529581,2.8221494698151468]
[null,null,null,null,null,null,null,null,null,null,null,null,null,null,null,null,null,null,null,null,null,null,null,null,null,null,null,null,null,0.31000000000000011,0.38777363058609932,-0.23680104597383125,2.9748333441903894]
[null,null,null,null,null,null,null,null,null,null,null,null,null,null,null,null,null,null,null,null,null,null,null,null,null,null,null,null,null,0.32000000000000012,0.41830065359477159,-0.2526566618898769,3.1338099394482786]
[null,null,null,null,null,null,null,null,null,null,null,null,null,null,null,null,null,null,null,null,null,null,null,null,null,null,null,null,null,0.33000000000000013,0.45044982937506495,-0.26914318340112248,3.2994625024985567]
[null,null,null,null,null,null,null,null,null,null,null,null,null,null,null,null,null,null,null,null,null,null,null,null,null,null,null,null,null,0.34000000000000014,0.48428990364474278,-0.28627901888764412,3.4722034914589721]
[null,null,null,null,null,null,null,null,null,null,null,null,null,null,null,null,null,null,null,null,null,null,null,null,null,null,null,null,null,0.35000000000000014,0.51989389920424445,-0.30408376301500584,3.6524772948271025]
[null,null,null,null,null,null,null,null,null,null,null,null,null,null,null,null,null,null,null,null,null,null,null,null,null,null,null,null,null,0.36000000000000015,0.55733944954128489,-0.32257827092292096,3.8407632505320608]
[null,null,null,null,null,null,null,null,null,null,null,null,null,null,null,null,null,null,null,null,null,null,null,null,null,null,null,null,null,0.37000000000000016,0.59670916421488573,-0.34178473969935252,4.0375790032716203]
[null,null,null,null,null,null,null,null,null,null,null,null,null,null,null,null,null,null,null,null,null,null,null,null,null,null,null,null,null,0.38000000000000017,0.63809102960671737,-0.36172679781451617,4.2434842441644376]
[null,null,null,null,null,null,null,null,null,null,null,null,null,null,null,null,null,null,null,null,null,null,null,null,null,null,null,null,null,0.39000000000000018,0.68157884909817457,-0.38242960328329367,4.4590848833005312]
[null,null,null,null,null,null,null,null,null,null,null,null,null,null,null,null,null,null,null,null,null,null,null,null,null,null,null,null,null,0.40000000000000019,0.72727272727272807,-0.4039199514299685,4.6850377134298364]
[null,null,null,null,null,null,null,null,null,null,null,null,null,null,null,null,null,null,null,null,null,null,null,null,null,null,null,null,null,0.4100000000000002,0.77527960336677137,-0.42622639324808687,4.9220556319947883]
[null,null,null,null,null,null,null,null,null,null,null,null,null,null,null,null,null,null,null,null,null,null,null,null,null,null,null,null,null,0.42000000000000021,0.82571383991262393,-0.44937936548308921,5.1709134992389947]
[null,null,null,null,null,null,null,null,null,null,null,null,null,null,null,null,null,null,null,null,null,null,null,null,null,null,null,null,null,0.43000000000000022,0.87869787335155136,-0.47341133371897087,5.4324547225155788]
[null,null,null,null,null,null,null,null,null,null,null,null,null,null,null,null,null,null,null,null,null,null,null,null,null,null,null,null,null,0.44000000000000022,0.9343629343629356,-0.49835694992596546,5.7075986715440399]
[null,null,null,null,null,null,null,null,null,null,null,null,null,null,null,null,null,null,null,null,null,null,null,null,null,null,null,null,null,0.45000000000000023,0.99284984678243227,-0.52425322612799352,5.9973490466764208]
[null,null,null,null,null,null,null,null,null,null,null,null,null,null,null,null,null,null,null,null,null,null,null,null,null,null,null,null,null,0.46000000000000024,1.0543099152964641,-0.55113972608103579,6.3028033427829753]
[null,null,null,null,null,null,null,null,null,null,null,null,null,null,null,null,null,null,null,null,null,null,null,null,null,null,null,null,null,0.47000000000000025,1.1189059136380919,-0.57905877712216591,6.6251635758362175]
[null,null,null,null,null,null,null,null,null,null,null,null,null,null,null,null,null,null,null,null,null,null,null,null,null,null,null,null,null,0.48000000000000026,1.1868131868131886,-0.60805570466033143,6.9657484684950752]
[null,null,null,null,null,null,null,null,null,null,null,null,null,null,null,null,null,null,null,null,null,null,null,null,null,null,null,null,null,0.49000000000000027,1.2582208830079935,-0.63817909214196544,7.3260073260073364]
[null,null,null,null,null,null,null,null,null,null,null,null,null,null,null,null,null,null,null,null,null,null,null,null,null,null,null,null,null,0.50000000000000022,1.333333333333335,-0.66948106974671007,7.7075358758459647]
[null,null,null,null,null,null,null,null,null,null,null,null,null,null,null,null,null,null,null,null,null,null,null,null,null,null,null,null,null,0.51000000000000023,1.4123716005249125,-0.70201763556238761,8.1120943952802484]
[null,null,null,null,null,null,null,null,null,null,null,null,null,null,null,null,null,null,null,null,null,null,null,null,null,null,null,null,null,0.52000000000000024,1.4955752212389402,-0.73584901356785704,8.5416285125736984]
[null,null,null,null,null,null,null,null,null,null,null,null,null,null,null,null,null,null,null,null,null,null,null,null,null,null,null,null,null,0.53000000000000025,1.5832041707763866,-0.77104005343452453,8.998293142228567]
[null,null,null,null,null,null,null,null,null,null,null,null,null,null,null,null,null,null,null,null,null,null,null,null,null,null,null,null,null,0.54000000000000026,1.6755410840835117,-0.80766067796279362,9.484480105869423]
[null,null,null,null,null,null,null,null,null,null,null,null,null,null,null,null,null,null,null,null,null,null,null,null,null,null,null,null,null,0.55000000000000027,1.7728937728937753,-0.84578638492416935,10.002850102044649]
[null,null,null,null,null,null,null,null,null,null,null,null,null,null,null,null,null,null,null,null,null,null,null,null,null,null,null,null,null,0.56000000000000028,1.8755980861244048,-0.88549881121447227,10.556369825618241]
[null,null,null,null,null,null,null,null,null,null,null,null,null,null,null,null,null,null,null,null,null,null,null,null,null,null,null,null,null,0.57000000000000028,1.9840211694061403,-0.92688636857753715,11.148355207192285]
[null,null,null,null,null,null,null,null,null,null,null,null,null,null,null,null,null,null,null,null,null,null,null,null,null,null,null,null,null,0.58000000000000029,2.0985651902682507,-0.97004496178026678,11.782521953732706]
[null,null,null,null,null,null,null,null,null,null,null,null,null,null,null,null,null,null,null,null,null,null,null,null,null,null,null,null,null,0.5900000000000003,2.2196716084807946,-1.0150788020692105,12.463044834413727]
[null,null,null,null,null,null,null,null,null,null,null,null,null,null,null,null,null,null,null,null,null,null,null,null,null,null,null,null,null,0.60000000000000031,2.3478260869565255,-1.0621013310917793,13.194627485187926]
[null,null,null,null,null,null,null,null,null,null,null,null,null,null,null,null,null,null,null,null,null,null,null,null,null,null,null,null,null,0.61000000000000032,2.4835641581845533,-1.1112362733170935,13.982584920800077]
[null,null,null,null,null,null,null,null,null,null,null,null,null,null,null,null,null,null,null,null,null,null,null,null,null,null,null,null,null,0.62000000000000033,2.6274777853725273,-1.162618838463312,14.832941469092585]
[null,null,null,null,null,null,null,null,null,null,null,null,null,null,null,null,null,null,null,null,null,null,null,null,null,null,null,null,null,0.63000000000000034,2.7802229875664053,{"$f":"0.00831451*$AD$9*AE78*(LN(AE78/$AG$11)-1)/$AG$11","v":-1.2163970996841136},15.752547512983126]
[null,null,null,null,null,null,null,null,null,null,null,null,null,null,null,null,null,null,null,null,null,null,null,null,null,null,null,null,null,0.64000000000000035,{"$f":"IF($AD$5=1,$C$2/($I$5+$F$5+$C$5+$L$5+($H$4+$K$4-$E$4-$B$4)*AD79),(0.08205821*$AD$9)/$C$2)^($H$4+$K$4-$E$4-$B$4)*($I$5+$H$4*AD79)^$H$4*($L$5+$K$4*AD79)^$K$4/($C$5-$B$4*AD79)^$B$4/($F$5-$E$4*AD79)^$E$4","v":2.9425287356321901},-1.2727335784841296,{"$f":"(AE80-AE78)/(AD80-AD78)","v":16.749219285274517}]
[null,null,null,null,null,null,null,null,null,null,null,null,null,null,null,null,null,null,null,null,null,null,null,null,null,null,null,null,null,0.65000000000000036,3.1152073732718959,-1.3318070737759125,17.831907070953331]
[null,null,null,null,null,null,null,null,null,null,null,null,null,null,null,null,null,null,null,null,null,null,null,null,null,null,null,null,null,0.66000000000000036,3.299166877051257,-1.3938147804890921,19.010898613026189]
[null,null,null,null,null,null,null,null,null,null,null,null,null,null,null,null,null,null,null,null,null,null,null,null,null,null,null,null,null,{"$f":"(MIN(IF($B$4=0,$F$5/$E$4,$C$5/$B$4),IF($E$4=0,$C$5/$B$4,$F$5/$E$4))+MIN(IF($H$4=0,$L$5/$K$4,$I$5/$H$4),IF($K$4=0,$I$5/$H$4,$L$5/$K$4)))/100+AD81","v":0.67000000000000037},3.49542534553242,-1.4589747531259603,20.298066403847795]
[null,null,null,null,null,null,null,null,null,null,null,null,null,null,null,null,null,null,null,null,null,null,null,null,null,null,null,null,null,0.68000000000000038,3.7051282051282133,-1.5275287821919208,21.707170029934211]
[null,null,null,null,null,null,null,null,null,null,null,null,null,null,null,null,null,null,null,null,null,null,null,null,null,null,null,null,null,0.69000000000000039,3.9295687461311046,-1.5997457672617172,23.254228041462113]
[null,null,null,null,null,null,null,null,null,null,null,null,null,null,null,null,null,null,null,null,null,null,null,null,null,null,null,null,null,0.7000000000000004,4.1702127659574559,-1.6759256905695465,24.957978243631953]
[null,null,null,null,null,null,null,null,null,null,null,null,null,null,null,null,null,null,null,null,null,null,null,null,null,null,null,null,null,0.71000000000000041,4.4287283110037441,-1.7564043207717723,26.840451290505495]
[null,null,null,null,null,null,null,null,null,null,null,null,null,null,null,null,null,null,null,null,null,null,null,null,null,null,null,null,null,0.72000000000000042,4.7070217917675663,-1.84155880973803,28.927690627873101]
[null,null,null,null,null,null,null,null,null,null,null,null,null,null,null,null,null,null,null,null,null,null,null,null,null,null,null,null,null,0.73000000000000043,5.0072821235612066,-1.9318143883575079,31.250663089324444]
[null,null,null,null,null,null,null,null,null,null,null,null,null,null,null,null,null,null,null,null,null,null,null,null,null,null,null,null,null,0.74000000000000044,5.3320350535540557,-2.0276524238181173,33.846420137729908]
[null,null,null,null,null,null,null,null,null,null,null,null,null,null,null,null,null,null,null,null,null,null,null,null,null,null,null,null,null,0.75000000000000044,5.6842105263158054,-2.129620175384066,36.759591860113183]
[null,null,null,null,null,null,null,null,null,null,null,null,null,null,null,null,null,null,null,null,null,null,null,null,null,null,null,null,null,0.76000000000000045,6.06722689075632,-2.2383426850540511,40.044327389433626]
[null,null,null,null,null,null,null,null,null,null,null,null,null,null,null,null,null,null,null,null,null,null,null,null,null,null,null,null,null,0.77000000000000046,6.4850970741044787,-2.3545373731459369,43.76684108409453]
[null,null,null,null,null,null,null,null,null,null,null,null,null,null,null,null,null,null,null,null,null,null,null,null,null,null,null,null,null,0.78000000000000047,6.9425637124382114,-2.4790320905191576,48.008790792242188]
[null,null,null,null,null,null,null,null,null,null,null,null,null,null,null,null,null,null,null,null,null,null,null,null,null,null,null,null,null,0.79000000000000048,7.4452728899493232,-2.6127876287600085,52.871814378090804]
[null,null,null,null,null,null,null,null,null,null,null,null,null,null,null,null,null,null,null,null,null,null,null,null,null,null,null,null,null,0.80000000000000049,8.0000000000000284,-2.7569260366506909,58.483702039355634]
[null,null,null,null,null,null,null,null,null,null,null,null,null,null,null,null,null,null,null,null,null,null,null,null,null,null,null,null,null,0.8100000000000005,8.614946930736437,-2.9127665796524682,65.006915629322691]
[null,null,null,null,null,null,null,null,null,null,null,null,null,null,null,null,null,null,null,null,null,null,null,null,null,null,null,null,null,0.82000000000000051,9.3001383125864834,-3.0818718757911912,72.650534354667172]
[null,null,null,null,null,null,null,null,null,null,null,null,null,null,null,null,null,null,null,null,null,null,null,null,null,null,null,null,null,0.83000000000000052,10.067957617829782,-3.2661077492469097,81.68729924671122]
[null,null,null,null,null,null,null,null,null,null,null,null,null,null,null,null,null,null,null,null,null,null,null,null,null,null,null,null,null,0.84000000000000052,10.933884297520709,-3.4677218234253822,92.478407768307491]
[null,null,null,null,null,null,null,null,null,null,null,null,null,null,null,null,null,null,null,null,null,null,null,null,null,null,null,null,null,0.85000000000000053,11.917525773195933,-3.6894480851113087,105.51037066188655]
[null,null,null,null,null,null,null,null,null,null,null,null,null,null,null,null,null,null,null,null,null,null,null,null,null,null,null,null,null,0.86000000000000054,13.044091710758442,-3.9346480060362121,121.45114776415269]
[null,null,null,null,null,null,null,null,null,null,null,null,null,null,null,null,null,null,null,null,null,null,null,null,null,null,null,null,null,0.87000000000000055,14.346548728478989,-4.2075039910442324,141.23803741290206]
[null,null,null,null,null,null,null,null,null,null,null,null,null,null,null,null,null,null,null,null,null,null,null,null,null,null,null,null,null,0.88000000000000056,15.868852459016486,-4.5132890713714211,166.2196912949629]
[null,null,null,null,null,null,null,null,null,null,null,null,null,null,null,null,null,null,null,null,null,null,null,null,null,null,null,null,null,0.89000000000000057,17.67094255437825,-4.8587497886039834,198.39411174305991]
[null,null,null,null,null,null,null,null,null,null,null,null,null,null,null,null,null,null,null,null,null,null,null,null,null,null,null,null,null,0.90000000000000058,19.836734693877688,-5.2526603089252744,240.8249021521074]
[null,null,null,null,null,null,null,null,null,null,null,null,null,null,null,null,null,null,null,null,null,null,null,null,null,null,null,null,null,0.91000000000000059,22.487440597420402,-5.7066400750218884,298.40716774515073]
[null,null,null,null,null,null,null,null,null,null,null,null,null,null,null,null,null,null,null,null,null,null,null,null,null,null,null,null,null,0.9200000000000006,25.804878048780708,-6.2363817452857075,379.36601707190914]
[null,null,null,null,null,null,null,null,null,null,null,null,null,null,null,null,null,null,null,null,null,null,null,null,null,null,null,null,null,0.9300000000000006,30.074760938858592,-6.8635142664180195,498.4200651723209]
[null,null,null,null,null,null,null,null,null,null,null,null,null,null,null,null,null,null,null,null,null,null,null,null,null,null,null,null,null,0.94000000000000061,35.773279352227135,-7.6183916071008948,684.14074093588749]
[null,null,null,null,null,null,null,null,null,null,null,null,null,null,null,null,null,null,null,null,null,null,null,null,null,null,null,null,null,0.95000000000000062,43.757575757576355,-8.5438684766289583,998.43280658223762]
[null,null,null,null,null,null,null,null,null,null,null,null,null,null,null,null,null,null,null,null,null,null,null,null,null,null,null,null,null,0.96000000000000063,55.741935483871906,-9.6978101562461152,1598.4391195659346]
[null,null,null,null,null,null,null,null,null,null,null,null,null,null,null,null,null,null,null,null,null,null,null,null,null,null,null,null,null,0.97000000000000064,75.726358148895073,-11.135184587849244,2998.4453944812954]
[null,null,null,null,null,null,null,null,null,null,null,null,null,null,null,null,null,null,null,null,null,null,null,null,null,null,null,null,null,0.98000000000000065,115.71084337349787,-12.702549137117421,7998.4516316341842]
[null,null,null,null,null,null,null,null,null,null,null,null,null,null,null,null,null,null,null,null,null,null,null,null,null,null,null,null,null,0.99000000000000066,235.69539078157891,-11.134846283433964,29998.456596603522]
[null,null,null,null,null,null,null,null,null,null,null,null,null,null,null,null,null,null,null,null,null,null,null,null,null,null,null,null,null,{"$f":"MIN(IF($B$4=0,$F$5/$E$4,$C$5/$B$4),IF($E$4=0,$C$5/$B$4,$F$5/$E$4))-(MIN(IF($B$4=0,$F$5/$E$4,$C$5/$B$4),IF($E$4=0,$C$5/$B$4,$F$5/$E$4))+MIN(IF($H$4=0,$L$5/$K$4,$I$5/$H$4),IF($K$4=0,$I$5/$H$4,$L$5/$K$4)))/250","v":0.996},595.68614891913467,20.405659164945877,239998.46061398205]
[null,null,null,null,null,null,null,null,null,null,null,null,null,null,null,null,null,null,null,null,null,null,null,null,null,null,null,null,null,{"$f":"MIN(IF($B$4=0,$F$5/$E$4,$C$5/$B$4),IF($E$4=0,$C$5/$B$4,$F$5/$E$4))-(MIN(IF($B$4=0,$F$5/$E$4,$C$5/$B$4),IF($E$4=0,$C$5/$B$4,$F$5/$E$4))+MIN(IF($H$4=0,$L$5/$K$4,$I$5/$H$4),IF($K$4=0,$I$5/$H$4,$L$5/$K$4)))/1000","v":0.999},2395.6815363072596,375.13133594291389,{"$f":"(AE116-AE115)/(AD116-AD115)","v":599998.46246270777}]

{"sheet":"Unprotected","index":6,"n_rows":116,"n_cols":35,"rows_kept":116,"cut":false,"hidden":false,"merged":[]}
[]
[{"$f":"IF($AD$5=1,\"Pressure:\",\"Volume:\")","v":"Pressure:"},null,3,{"$f":"IF($AD$5=1,IF($AD$5=1,\"atm\",\"bar\"),\"L\")","v":"atm"},null,null,null,null,null,null,null,null,null,null,null,null,null,null,null,null,null,null,null,null,null,null,null,null,null,1,"Celsius","A=",5]
["Temperature:",null,{"$f":"$AD$9-273*IF($AD$2=1,1,0)","v":1296},{"$f":"IF(AD2=1,\"C\",\"K\")","v":"C"},null,null,null,null,null,null,null,null,null,null,null,null,null,null,null,null,null,null,null,null,null,null,null,null,null,null,"Kelvin"]
["Reaction:",1,"A","+",0,"B",null,2,"C","+",0,"D",null,null,null,null,null,null,null,null,null,null,null,null,null,null,null,null,null,{"$f":"(VLOOKUP(AG11,AE13:AI116,3)+(VLOOKUP(AG11,AE13:AI116,5)-VLOOKUP(AG11,AE13:AI116,3))*(AG11-VLOOKUP(AG11,AE13:AH116,1))/(VLOOKUP(AG11,AE13:AH116,4)-VLOOKUP(AG11,AE13:AH116,1)))/AG11/10000","v":9.4295207781101651E-3},"Equilibrium Sensitivity","B=",0]
["initial (moles):",null,1,null,null,1,null,null,0,null,null,2,"Units:",null,null,null,null,null,null,null,null,null,null,null,null,null,null,null,null,1,"Constant Pressure","C=",0]
[{"$f":"IF($AD$7=1,\"initial (atm):\",\"initial (M):\")","v":"initial (atm):"},null,{"$f":"IF($AD$5=1,$C$2*C5/SUM($C$5:$L$5),0.08205821*$AD$9*C5/$C$2)/(0.08205821*$AD$9)^($AD$7-1)","v":0.75},null,null,{"$f":"IF($AD$5=1,$C$2*F5/SUM($C$5:$L$5),0.08205821*$AD$9*F5/$C$2)/(0.08205821*$AD$9)^($AD$7-1)","v":0.75},null,null,{"$f":"IF($AD$5=1,$C$2*I5/SUM($C$5:$L$5),0.08205821*$AD$9*I5/$C$2)/(0.08205821*$AD$9)^($AD$7-1)","v":0},null,null,{"$f":"IF($AD$5=1,$C$2*L5/SUM($C$5:$L$5),0.08205821*$AD$9*L5/$C$2)/(0.08205821*$AD$9)^($AD$7-1)","v":1.5},{"$f":"IF($AD$7=1,\"Qpi = \",\"Qci = \")","v":"Qpi = "},{"$f":"IF(C5*F5=0,\"∞\",(I6^$H$4)*(L6^$K$4)/(F6)^$E$4/(C6)^$B$4)","v":0},null,"Initial Reaction Quotient",null,null,null,null,null,null,null,null,null,null,null,null,null,null,"Constant Volume","D=",0]
["change (moles):",null,{"$f":"-N7*B4","v":-0.98446614887162909},null,null,{"$f":"-E4*N7","v":0},null,null,{"$f":"H4*N7","v":1.9689322977432582},null,null,{"$f":"K4*N7","v":0},"x =",{"$f":"-MIN(IF($H$4=0,$L$5/$K$4,$I$5/$H$4),IF($K$4=0,$I$5/$H$4,$L$5/$K$4))+($AD$11/29999)*(MIN(IF($B$4=0,$F$5/$E$4,$C$5/$B$4),IF($E$4=0,$C$5/$B$4,$F$5/$E$4))+MIN(IF($H$4=0,$L$5/$K$4,$I$5/$H$4),IF($K$4=0,$I$5/$H$4,$L$5/$K$4)))","v":0.98446614887162909},"mol","Extent of Reaction",null,null,null,null,null,null,null,null,null,null,null,null,null,1,"Atmospheres","E=",0]
[{"$f":"IF(ABS(N9/N10-1)<AD4,\"equilibrium (moles):\",\"equilibrating ... (moles):\")","v":"equilibrating ... (moles):"},null,{"$f":"C7+C5","v":1.5533851128370912E-2},null,null,{"$f":"F7+F5","v":1},null,null,{"$f":"I7+I5","v":1.9689322977432582},null,null,{"$f":"L5+L7","v":2},null,null,null,null,null,null,null,null,null,null,null,null,null,null,null,null,null,null,"Molarity","F=",0]
[{"$f":"IF(ABS(N9/N10-1)<AD4,IF($AD$7=1,\"equilibrium (atm):\",\"equilibrium (M)\"),IF($AD$7=1,\"equilibrating ... (atm):\",\"equilibrating…(M)\"))","v":"equilibrating ... (atm):"},null,{"$f":"IF($AD$5=1,$C$2*(C5+C7)/SUM($C$5:$L$5,$C$7:$L$7),(C5+C7)*0.08205821*$AD$9/$C$2)/(0.08205821*$AD$9)^($AD$7-1)","v":9.3493569809200688E-3},null,null,{"$f":"IF($AD$5=1,$C$2*(F5+F7)/SUM($C$5:$L$5,$C$7:$L$7),(F5+F7)*0.08205821*$AD$9/$C$2)/(0.08205821*$AD$9)^($AD$7-1)","v":0.60186987139618398},null,null,{"$f":"IF($AD$5=1,$C$2*(I5+I7)/SUM($C$5:$L$5,$C$7:$L$7),(I5+I7)*0.08205821*$AD$9/$C$2)/(0.08205821*$AD$9)^($AD$7-1)","v":1.185041028830528},null,null,{"$f":"IF($AD$5=1,$C$2*(L5+L7)/SUM($C$5:$L$5,$C$7:$L$7),(L5+L7)*0.08205821*$AD$9/$C$2)/(0.08205821*$AD$9)^($AD$7-1)","v":1.203739742792368},{"$f":"IF($AD$7=1,\"Qp = \",\"Qc = \")","v":"Qp = "},{"$f":"(I9^H4)*(L9^K4)/(C9^B4)/(F9^E4)","v":150.20522190751956},null,"Reaction Quotient",null,null,null,null,null,null,null,null,null,null,null,null,null,1569,"Temperature (k)","lnK =",{"$f":"AG2+AG4/AD9+AG5*LN(AD9)+AG6*AD9+AG7*AD9^2+AG8*AD9^3","v":5}]
[null,null,null,null,null,null,null,null,null,null,null,null,{"$f":"IF($AD$7=1,\"Kp = \",\"Kc = \")","v":"Kp = "},{"$f":"IF($AD$7=1,$AG$11,$AG$11*(0.08205821*$AD$9)^(E4+B4-H4))","v":148.4131591025766},null,"Equilibrium Constant",null,null,null,null,null,null,null,null,null,null,null,null,null,null,null,null," (LnK = A + B/T +ClnK + DT + ET^2 + FT^3)"]
[{"$f":"IF(ABS($N$9/$N$10-1)<AD4,\"\",IF($N$9>$N$10,\"¬\",\"®\"))","v":"¬"},null,{"$f":"IF(ABS(N9/N10-1)<AD4,\"Equilibrium!\",IF(N9>N10,\"Too far.\",\"Not far enough…\"))","v":"Too far."},null,null,null,null,null,{"$f":"IF(ABS($N$9/$N$10-1)<AD4,\"\",IF($N$9>$N$10,\"¬\",\"®\"))","v":"¬"},null,null,null,"G =",{"$f":"0.00831451*$AD$9*N9*(LN(N9/N10)-1)/N10","v":-13.044518971386887},"kJ","Gibb's Free Energy",null,null,null,null,null,null,null,null,null,null,null,null,null,29533,"Slider Position","Kp =",{"$f":"EXP(AG9)","v":148.4131591025766}]
[null,null,null,null,null,null,null,null,null,null,null,null,"ΔG =",{"$f":"0.00831451*$AD$9*LN(N9/N10)","v":0.15657827431228327},"kJ/mol",null,null,null,null,null,null,null,null,null,null,null,null,null,null,"x","Qp","G"]
[null,null,null,null,null,null,null,null,null,null,null,null,null,null,null,null,null,null,null,null,null,null,null,null,null,null,null,null,null,{"$f":"-MIN(IF($H$4=0,$L$5/$K$4,$I$5/$H$4),IF($K$4=0,$I$5/$H$4,$L$5/$K$4))","v":0},0,0,{"$f":"(AE14-AE13)/(AD14-AD13)","v":3.0022524398930295E-3},{"$f":"AE14","v":3.0022524398930294E-6},{"$f":"AG14","v":1.2036156614469868E-2}]
[null,null,null,null,null,null,null,null,null,null,null,null,null,null,null,null,null,null,null,null,null,null,null,null,null,null,null,null,null,{"$f":"(MIN(IF($B$4=0,$F$5/$E$4,$C$5/$B$4),IF($E$4=0,$C$5/$B$4,$F$5/$E$4))+MIN(IF($H$4=0,$L$5/$K$4,$I$5/$H$4),IF($K$4=0,$I$5/$H$4,$L$5/$K$4)))/1000+AD13","v":1E-3},{"$f":"IF($AD$5=1,$C$2/($I$5+$F$5+$C$5+$L$5+($H$4+$K$4-$E$4-$B$4)*AD14),(0.08205821*$AD$9)/$C$2)^($H$4+$K$4-$E$4-$B$4)*($I$5+$H$4*AD14)^$H$4*($L$5+$K$4*AD14)^$K$4/($C$5-$B$4*AD14)^$B$4/($F$5-$E$4*AD14)^$E$4","v":3.0022524398930294E-6},{"$f":"0.00831451*$AD$9*AE14*(LN(AE14/$AG$11)-1)/$AG$11","v":-4.9391346406235257E-6},{"$f":"(AE15-AE13)/(AD15-AD13)","v":1.2036156614469868E-2},{"$f":"AE15","v":4.8144626457879473E-5},{"$f":"AG15","v":3.3252484894354145E-2}]
[null,null,null,null,null,null,null,null,null,null,null,null,null,null,null,null,null,null,null,null,null,null,null,null,null,null,null,null,null,{"$f":"(MIN(IF($B$4=0,$F$5/$E$4,$C$5/$B$4),IF($E$4=0,$C$5/$B$4,$F$5/$E$4))+MIN(IF($H$4=0,$L$5/$K$4,$I$5/$H$4),IF($K$4=0,$I$5/$H$4,$L$5/$K$4)))/250+AD13","v":4.0000000000000001E-3},{"$f":"IF($AD$5=1,$C$2/($I$5+$F$5+$C$5+$L$5+($H$4+$K$4-$E$4-$B$4)*AD15),(0.08205821*$AD$9)/$C$2)^($H$4+$K$4-$E$4-$B$4)*($I$5+$H$4*AD15)^$H$4*($L$5+$K$4*AD15)^$K$4/($C$5-$B$4*AD15)^$B$4/($F$5-$E$4*AD15)^$E$4","v":4.8144626457879473E-5},-6.7461932593736187E-5,{"$f":"(AE16-AE14)/(AD16-AD14)","v":3.3252484894354145E-2},3.0227461648908038E-4,7.3140823776629268E-2]
[null,null,null,null,null,null,null,null,null,null,null,null,null,null,null,null,null,null,null,null,null,null,null,null,null,null,null,null,null,{"$f":"(MIN(IF($B$4=0,$F$5/$E$4,$C$5/$B$4),IF($E$4=0,$C$5/$B$4,$F$5/$E$4))+MIN(IF($H$4=0,$L$5/$K$4,$I$5/$H$4),IF($K$4=0,$I$5/$H$4,$L$5/$K$4)))/100+AD13","v":0.01},3.0227461648908038E-4,-3.7474560600292086E-4,7.3140823776629268E-2,1.2183978068839479E-3,0.12302548280528174]
[null,null,null,null,null,null,null,null,null,null,null,null,null,null,null,null,null,null,null,null,null,null,null,null,null,null,null,null,null,{"$f":"(MIN(IF($B$4=0,$F$5/$E$4,$C$5/$B$4),IF($E$4=0,$C$5/$B$4,$F$5/$E$4))+MIN(IF($H$4=0,$L$5/$K$4,$I$5/$H$4),IF($K$4=0,$I$5/$H$4,$L$5/$K$4)))/100+AD16","v":0.02},1.2183978068839479E-3,-1.3612231333108031E-3,0.12302548280528174,2.7627842725947145E-3,0.18660486213105013]
[null,null,null,null,null,null,null,null,null,null,null,null,null,null,null,null,null,null,null,null,null,null,null,null,null,null,null,null,null,{"$f":"(MIN(IF($B$4=0,$F$5/$E$4,$C$5/$B$4),IF($E$4=0,$C$5/$B$4,$F$5/$E$4))+MIN(IF($H$4=0,$L$5/$K$4,$I$5/$H$4),IF($K$4=0,$I$5/$H$4,$L$5/$K$4)))/100+AD17","v":0.03},2.7627842725947145E-3,-2.8878285464534088E-3,0.18660486213105013,4.9504950495049506E-3,0.25172433412854894]
[null,null,null,null,null,null,null,null,null,null,null,null,null,null,null,null,null,null,null,null,null,null,null,null,null,null,null,null,null,0.04,4.9504950495049506E-3,-4.9207568472821239E-3,0.25172433412854894,7.7972709551656942E-3,0.31845365649655855]
[null,null,null,null,null,null,null,null,null,null,null,null,null,null,null,null,null,null,null,null,null,null,null,null,null,null,null,null,null,0.05,7.7972709551656942E-3,-7.4390743045680092E-3,0.31845365649655855,1.1319568179436123E-2,0.38686626122958884]
[null,null,null,null,null,null,null,null,null,null,null,null,null,null,null,null,null,null,null,null,null,null,null,null,null,null,null,null,null,6.0000000000000005E-2,1.1319568179436123E-2,-1.0428671513756389E-2,0.38686626122958884,1.5534596179757472E-2,0.45703949384149306]
[null,null,null,null,null,null,null,null,null,null,null,null,null,null,null,null,null,null,null,null,null,null,null,null,null,null,null,null,null,7.0000000000000007E-2,1.5534596179757472E-2,-1.3879733201478339E-2,0.45703949384149306,2.0460358056265983E-2,0.52905487087993608]
[null,null,null,null,null,null,null,null,null,null,null,null,null,null,null,null,null,null,null,null,null,null,null,null,null,null,null,null,null,0.08,2.0460358056265983E-2,-1.778543464655287E-2,0.52905487087993608,2.6115693597356188E-2,0.60299835734930263]
[null,null,null,null,null,null,null,null,null,null,null,null,null,null,null,null,null,null,null,null,null,null,null,null,null,null,null,null,null,0.09,2.6115693597356188E-2,-2.2141184213254089E-2,0.60299835734930263,3.2520325203252029E-2,0.6789606658223406]
[null,null,null,null,null,null,null,null,null,null,null,null,null,null,null,null,null,null,null,null,null,null,null,null,null,null,null,null,null,9.9999999999999992E-2,3.2520325203252029E-2,-2.6944147105431585E-2,0.6789606658223406,3.9694906913802994E-2,0.75703757920191739]
[null,null,null,null,null,null,null,null,null,null,null,null,null,null,null,null,null,null,null,null,null,null,null,null,null,null,null,null,null,0.10999999999999999,3.9694906913802994E-2,-3.2192929055808603E-2,0.75703757920191739,4.7661076787290368E-2,0.83733029929607383]
[null,null,null,null,null,null,null,null,null,null,null,null,null,null,null,null,null,null,null,null,null,null,null,null,null,null,null,null,null,0.11999999999999998,4.7661076787290368E-2,-3.7887357887685533E-2,0.83733029929607383,5.6441512899724461E-2,0.91994582359469901]
[null,null,null,null,null,null,null,null,null,null,null,null,null,null,null,null,null,null,null,null,null,null,null,null,null,null,null,null,null,0.12999999999999998,5.6441512899724461E-2,-4.4028328488455462E-2,0.91994582359469901,6.6059993259184352E-2,1.0049973528876237]
["Developed by Prof. Douglas A. Vander Griend, Calvin College, Grand Rapids, MI",null,null,null,null,null,null,null,null,null,null,null,null,null,null,null,null,null,null,null,null,null,null,null,null,null,null,null,null,0.13999999999999999,6.6059993259184352E-2,-5.0617690822193181E-2,1.0049973528876237,7.6541459957476951E-2,1.0926047326451773]
[null,null,null,null,null,null,null,null,null,null,null,null,null,null,null,null,null,null,null,null,null,null,null,null,null,null,null,null,null,0.15,7.6541459957476951E-2,-5.7658168325152435E-2,1.0926047326451773,8.7912087912087919E-2,1.1828949313971933]
[null,null,null,null,null,null,null,null,null,null,null,null,null,null,null,null,null,null,null,null,null,null,null,null,null,null,null,null,null,0.16,8.7912087912087919E-2,-6.5153298501891513E-2,1.1828949313971933,0.10019935858542084,1.2760025596996081]
[null,null,null,null,null,null,null,null,null,null,null,null,null,null,null,null,null,null,null,null,null,null,null,null,null,null,null,null,null,0.17,0.10019935858542084,-7.3107390258340579E-2,1.2760025596996081,0.1134321391060801,1.3720704336742442]
[null,null,null,null,null,null,null,null,null,null,null,null,null,null,null,null,null,null,null,null,null,null,null,null,null,null,null,null,null,0.18000000000000002,0.1134321391060801,-8.1525494227078957E-2,1.3720704336742442,0.12764076725890575,1.4712501875531387]
[null,null,null,null,null,null,null,null,null,null,null,null,null,null,null,null,null,null,null,null,null,null,null,null,null,null,null,null,null,0.19000000000000003,0.12764076725890575,-9.0413383465007824E-2,1.4712501875531387,0.1428571428571429,1.5737029401606428]
[null,null,null,null,null,null,null,null,null,null,null,null,null,null,null,null,null,null,null,null,null,null,null,null,null,null,null,null,null,0.20000000000000004,0.1428571428571429,-9.9777542662541227E-2,1.5737029401606428,0.15911482606211863,1.6796000208322504]
[null,null,null,null,null,null,null,null,null,null,null,null,null,null,null,null,null,null,null,null,null,null,null,null,null,null,null,null,null,0.21000000000000005,0.15911482606211863,-0.10962516452984808,1.6796000208322504,0.17644914327378794,1.7891237609080732]
[null,null,null,null,null,null,null,null,null,null,null,null,null,null,null,null,null,null,null,null,null,null,null,null,null,null,null,null,null,0.22000000000000006,0.17644914327378794,-0.11996415240039662,1.7891237609080732,0.19489730128028013,1.9024683576611547]
[null,null,null,null,null,null,null,null,null,null,null,null,null,null,null,null,null,null,null,null,null,null,null,null,null,null,null,null,null,0.23000000000000007,0.19489730128028013,-0.13080312836559699,1.9024683576611547,0.21449851042701107,2.0198408183389427]
[null,null,null,null,null,null,null,null,null,null,null,null,null,null,null,null,null,null,null,null,null,null,null,null,null,null,null,null,null,0.24000000000000007,0.21449851042701107,-0.14215144645912556,2.0198408183389427,0.23529411764705896,2.141461992924294]
[null,null,null,null,null,null,null,null,null,null,null,null,null,null,null,null,null,null,null,null,null,null,null,null,null,null,null,null,null,0.25000000000000006,0.23529411764705896,-0.15401921056691764,2.141461992924294,0.25732775028549693,2.2675677052765817]
[null,null,null,null,null,null,null,null,null,null,null,null,null,null,null,null,null,null,null,null,null,null,null,null,null,null,null,null,null,0.26000000000000006,0.25732775028549693,-0.16641729686322659,2.2675677052765817,0.28064547175259064,2.398409993513321]
[null,null,null,null,null,null,null,null,null,null,null,null,null,null,null,null,null,null,null,null,null,null,null,null,null,null,null,null,null,0.27000000000000007,0.28064547175259064,-0.1793573806745154,2.398409993513321,0.30529595015576338,2.5342584718602823]
[null,null,null,null,null,null,null,null,null,null,null,null,null,null,null,null,null,null,null,null,null,null,null,null,null,null,null,null,null,0.28000000000000008,0.30529595015576338,-0.19285196775828664,2.5342584718602823,0.33133064118979633,2.675401827760016]
[null,null,null,null,null,null,null,null,null,null,null,null,null,null,null,null,null,null,null,null,null,null,null,null,null,null,null,null,null,0.29000000000000009,0.33133064118979633,-0.2069144300583533,2.675401827760016,0.35880398671096375,2.8221494698151468]
[null,null,null,null,null,null,null,null,null,null,null,null,null,null,null,null,null,null,null,null,null,null,null,null,null,null,null,null,null,0.3000000000000001,0.35880398671096375,-0.22155904606529581,2.8221494698151468,0.38777363058609932,2.9748333441903894]
[null,null,null,null,null,null,null,null,null,null,null,null,null,null,null,null,null,null,null,null,null,null,null,null,null,null,null,null,null,0.31000000000000011,0.38777363058609932,-0.23680104597383125,2.9748333441903894,0.41830065359477159,3.1338099394482786]
[null,null,null,null,null,null,null,null,null,null,null,null,null,null,null,null,null,null,null,null,null,null,null,null,null,null,null,null,null,0.32000000000000012,0.41830065359477159,-0.2526566618898769,3.1338099394482786,0.45044982937506495,3.2994625024985567]
[null,null,null,null,null,null,null,null,null,null,null,null,null,null,null,null,null,null,null,null,null,null,null,null,null,null,null,null,null,0.33000000000000013,0.45044982937506495,-0.26914318340112248,3.2994625024985567,0.48428990364474278,3.4722034914589721]
[null,null,null,null,null,null,null,null,null,null,null,null,null,null,null,null,null,null,null,null,null,null,null,null,null,null,null,null,null,0.34000000000000014,0.48428990364474278,-0.28627901888764412,3.4722034914589721,0.51989389920424445,3.6524772948271025]
[null,null,null,null,null,null,null,null,null,null,null,null,null,null,null,null,null,null,null,null,null,null,null,null,null,null,null,null,null,0.35000000000000014,0.51989389920424445,-0.30408376301500584,3.6524772948271025,0.55733944954128489,3.8407632505320608]
[null,null,null,null,null,null,null,null,null,null,null,null,null,null,null,null,null,null,null,null,null,null,null,null,null,null,null,null,null,0.36000000000000015,0.55733944954128489,-0.32257827092292096,3.8407632505320608,0.59670916421488573,4.0375790032716203]
[null,null,null,null,null,null,null,null,null,null,null,null,null,null,null,null,null,null,null,null,null,null,null,null,null,null,null,null,null,0.37000000000000016,0.59670916421488573,-0.34178473969935252,4.0375790032716203,0.63809102960671737,4.2434842441644376]
[null,null,null,null,null,null,null,null,null,null,null,null,null,null,null,null,null,null,null,null,null,null,null,null,null,null,null,null,null,0.38000000000000017,0.63809102960671737,-0.36172679781451617,4.2434842441644376,0.68157884909817457,4.4590848833005312]
[null,null,null,null,null,null,null,null,null,null,null,null,null,null,null,null,null,null,null,null,null,null,null,null,null,null,null,null,null,0.39000000000000018,0.68157884909817457,-0.38242960328329367,4.4590848833005312,0.72727272727272807,4.6850377134298364]
[null,null,null,null,null,null,null,null,null,null,null,null,null,null,null,null,null,null,null,null,null,null,null,null,null,null,null,null,null,0.40000000000000019,0.72727272727272807,-0.4039199514299685,4.6850377134298364,0.77527960336677137,4.9220556319947883]
[null,null,null,null,null,null,null,null,null,null,null,null,null,null,null,null,null,null,null,null,null,null,null,null,null,null,null,null,null,0.4100000000000002,0.77527960336677137,-0.42622639324808687,4.9220556319947883,0.82571383991262393,5.1709134992389947]
[null,null,null,null,null,null,null,null,null,null,null,null,null,null,null,null,null,null,null,null,null,null,null,null,null,null,null,null,null,0.42000000000000021,0.82571383991262393,-0.44937936548308921,5.1709134992389947,0.87869787335155136,5.4324547225155788]
[null,null,null,null,null,null,null,null,null,null,null,null,null,null,null,null,null,null,null,null,null,null,null,null,null,null,null,null,null,0.43000000000000022,0.87869787335155136,-0.47341133371897087,5.4324547225155788,0.9343629343629356,5.7075986715440399]
[null,null,null,null,null,null,null,null,null,null,null,null,null,null,null,null,null,null,null,null,null,null,null,null,null,null,null,null,null,0.44000000000000022,0.9343629343629356,-0.49835694992596546,5.7075986715440399,0.99284984678243227,5.9973490466764208]
[null,null,null,null,null,null,null,null,null,null,null,null,null,null,null,null,null,null,null,null,null,null,null,null,null,null,null,null,null,0.45000000000000023,0.99284984678243227,-0.52425322612799352,5.9973490466764208,1.0543099152964641,6.3028033427829753]
[null,null,null,null,null,null,null,null,null,null,null,null,null,null,null,null,null,null,null,null,null,null,null,null,null,null,null,null,null,0.46000000000000024,1.0543099152964641,-0.55113972608103579,6.3028033427829753,1.1189059136380919,6.6251635758362175]
[null,null,null,null,null,null,null,null,null,null,null,null,null,null,null,null,null,null,null,null,null,null,null,null,null,null,null,null,null,0.47000000000000025,1.1189059136380919,-0.57905877712216591,6.6251635758362175,1.1868131868131886,6.9657484684950752]
[null,null,null,null,null,null,null,null,null,null,null,null,null,null,null,null,null,null,null,null,null,null,null,null,null,null,null,null,null,0.48000000000000026,1.1868131868131886,-0.60805570466033143,6.9657484684950752,1.2582208830079935,7.3260073260073364]
[null,null,null,null,null,null,null,null,null,null,null,null,null,null,null,null,null,null,null,null,null,null,null,null,null,null,null,null,null,0.49000000000000027,1.2582208830079935,-0.63817909214196544,7.3260073260073364,1.333333333333335,7.7075358758459647]
[null,null,null,null,null,null,null,null,null,null,null,null,null,null,null,null,null,null,null,null,null,null,null,null,null,null,null,null,null,0.50000000000000022,1.333333333333335,-0.66948106974671007,7.7075358758459647,1.4123716005249125,8.1120943952802484]
[null,null,null,null,null,null,null,null,null,null,null,null,null,null,null,null,null,null,null,null,null,null,null,null,null,null,null,null,null,0.51000000000000023,1.4123716005249125,-0.70201763556238761,8.1120943952802484,1.4955752212389402,8.5416285125736984]
[null,null,null,null,null,null,null,null,null,null,null,null,null,null,null,null,null,null,null,null,null,null,null,null,null,null,null,null,null,0.52000000000000024,1.4955752212389402,-0.73584901356785704,8.5416285125736984,1.5832041707763866,8.998293142228567]
[null,null,null,null,null,null,null,null,null,null,null,null,null,null,null,null,null,null,null,null,null,null,null,null,null,null,null,null,null,0.53000000000000025,1.5832041707763866,-0.77104005343452453,8.998293142228567,1.6755410840835117,9.484480105869423]
[null,null,null,null,null,null,null,null,null,null,null,null,null,null,null,null,null,null,null,null,null,null,null,null,null,null,null,null,null,0.54000000000000026,1.6755410840835117,-0.80766067796279362,9.484480105869423,1.7728937728937753,10.002850102044649]
[null,null,null,null,null,null,null,null,null,null,null,null,null,null,null,null,null,null,null,null,null,null,null,null,null,null,null,null,null,0.55000000000000027,1.7728937728937753,-0.84578638492416935,10.002850102044649,1.8755980861244048,10.556369825618241]
[null,null,null,null,null,null,null,null,null,null,null,null,null,null,null,null,null,null,null,null,null,null,null,null,null,null,null,null,null,0.56000000000000028,1.8755980861244048,-0.88549881121447227,10.556369825618241,1.9840211694061403,11.148355207192285]
[null,null,null,null,null,null,null,null,null,null,null,null,null,null,null,null,null,null,null,null,null,null,null,null,null,null,null,null,null,0.57000000000000028,1.9840211694061403,-0.92688636857753715,11.148355207192285,2.0985651902682507,11.782521953732706]
[null,null,null,null,null,null,null,null,null,null,null,null,null,null,null,null,null,null,null,null,null,null,null,null,null,null,null,null,null,0.58000000000000029,2.0985651902682507,-0.97004496178026678,11.782521953732706,2.2196716084807946,12.463044834413727]
[null,null,null,null,null,null,null,null,null,null,null,null,null,null,null,null,null,null,null,null,null,null,null,null,null,null,null,null,null,0.5900000000000003,2.2196716084807946,-1.0150788020692105,12.463044834413727,2.3478260869565255,13.194627485187926]
[null,null,null,null,null,null,null,null,null,null,null,null,null,null,null,null,null,null,null,null,null,null,null,null,null,null,null,null,null,0.60000000000000031,2.3478260869565255,-1.0621013310917793,13.194627485187926,2.4835641581845533,13.982584920800077]
[null,null,null,null,null,null,null,null,null,null,null,null,null,null,null,null,null,null,null,null,null,null,null,null,null,null,null,null,null,0.61000000000000032,2.4835641581845533,-1.1112362733170935,13.982584920800077,2.6274777853725273,14.832941469092585]
[null,null,null,null,null,null,null,null,null,null,null,null,null,null,null,null,null,null,null,null,null,null,null,null,null,null,null,null,null,0.62000000000000033,2.6274777853725273,-1.162618838463312,14.832941469092585,2.7802229875664053,15.752547512983126]
[null,null,null,null,null,null,null,null,null,null,null,null,null,null,null,null,null,null,null,null,null,null,null,null,null,null,null,null,null,0.63000000000000034,2.7802229875664053,{"$f":"0.00831451*$AD$9*AE78*(LN(AE78/$AG$11)-1)/$AG$11","v":-1.2163970996841136},15.752547512983126,{"$f":"AE79","v":2.9425287356321901},{"$f":"AG79","v":16.749219285274517}]
[null,null,null,null,null,null,null,null,null,null,null,null,null,null,null,null,null,null,null,null,null,null,null,null,null,null,null,null,null,0.64000000000000035,{"$f":"IF($AD$5=1,$C$2/($I$5+$F$5+$C$5+$L$5+($H$4+$K$4-$E$4-$B$4)*AD79),(0.08205821*$AD$9)/$C$2)^($H$4+$K$4-$E$4-$B$4)*($I$5+$H$4*AD79)^$H$4*($L$5+$K$4*AD79)^$K$4/($C$5-$B$4*AD79)^$B$4/($F$5-$E$4*AD79)^$E$4","v":2.9425287356321901},-1.2727335784841296,{"$f":"(AE80-AE78)/(AD80-AD78)","v":16.749219285274517},3.1152073732718959,17.831907070953331]
[null,null,null,null,null,null,null,null,null,null,null,null,null,null,null,null,null,null,null,null,null,null,null,null,null,null,null,null,null,0.65000000000000036,3.1152073732718959,-1.3318070737759125,17.831907070953331,3.299166877051257,19.010898613026189]
[null,null,null,null,null,null,null,null,null,null,null,null,null,null,null,null,null,null,null,null,null,null,null,null,null,null,null,null,null,0.66000000000000036,3.299166877051257,-1.3938147804890921,19.010898613026189,3.49542534553242,20.298066403847795]
[null,null,null,null,null,null,null,null,null,null,null,null,null,null,null,null,null,null,null,null,null,null,null,null,null,null,null,null,null,{"$f":"(MIN(IF($B$4=0,$F$5/$E$4,$C$5/$B$4),IF($E$4=0,$C$5/$B$4,$F$5/$E$4))+MIN(IF($H$4=0,$L$5/$K$4,$I$5/$H$4),IF($K$4=0,$I$5/$H$4,$L$5/$K$4)))/100+AD81","v":0.67000000000000037},3.49542534553242,-1.4589747531259603,20.298066403847795,3.7051282051282133,21.707170029934211]
[null,null,null,null,null,null,null,null,null,null,null,null,null,null,null,null,null,null,null,null,null,null,null,null,null,null,null,null,null,0.68000000000000038,3.7051282051282133,-1.5275287821919208,21.707170029934211,3.9295687461311046,23.254228041462113]
[null,null,null,null,null,null,null,null,null,null,null,null,null,null,null,null,null,null,null,null,null,null,null,null,null,null,null,null,null,0.69000000000000039,3.9295687461311046,-1.5997457672617172,23.254228041462113,4.1702127659574559,24.957978243631953]
[null,null,null,null,null,null,null,null,null,null,null,null,null,null,null,null,null,null,null,null,null,null,null,null,null,null,null,null,null,0.7000000000000004,4.1702127659574559,-1.6759256905695465,24.957978243631953,4.4287283110037441,26.840451290505495]
[null,null,null,null,null,null,null,null,null,null,null,null,null,null,null,null,null,null,null,null,null,null,null,null,null,null,null,null,null,0.71000000000000041,4.4287283110037441,-1.7564043207717723,26.840451290505495,4.7070217917675663,28.927690627873101]
[null,null,null,null,null,null,null,null,null,null,null,null,null,null,null,null,null,null,null,null,null,null,null,null,null,null,null,null,null,0.72000000000000042,4.7070217917675663,-1.84155880973803,28.927690627873101,5.0072821235612066,31.250663089324444]
[null,null,null,null,null,null,null,null,null,null,null,null,null,null,null,null,null,null,null,null,null,null,null,null,null,null,null,null,null,0.73000000000000043,5.0072821235612066,-1.9318143883575079,31.250663089324444,5.3320350535540557,33.846420137729908]
[null,null,null,null,null,null,null,null,null,null,null,null,null,null,null,null,null,null,null,null,null,null,null,null,null,null,null,null,null,0.74000000000000044,5.3320350535540557,-2.0276524238181173,33.846420137729908,5.6842105263158054,36.759591860113183]
[null,null,null,null,null,null,null,null,null,null,null,null,null,null,null,null,null,null,null,null,null,null,null,null,null,null,null,null,null,0.75000000000000044,5.6842105263158054,-2.129620175384066,36.759591860113183,6.06722689075632,40.044327389433626]
[null,null,null,null,null,null,null,null,null,null,null,null,null,null,null,null,null,null,null,null,null,null,null,null,null,null,null,null,null,0.76000000000000045,6.06722689075632,-2.2383426850540511,40.044327389433626,6.4850970741044787,43.76684108409453]
[null,null,null,null,null,null,null,null,null,null,null,null,null,null,null,null,null,null,null,null,null,null,null,null,null,null,null,null,null,0.77000000000000046,6.4850970741044787,-2.3545373731459369,43.76684108409453,6.9425637124382114,48.008790792242188]
[null,null,null,null,null,null,null,null,null,null,null,null,null,null,null,null,null,null,null,null,null,null,null,null,null,null,null,null,null,0.78000000000000047,6.9425637124382114,-2.4790320905191576,48.008790792242188,7.4452728899493232,52.871814378090804]
[null,null,null,null,null,null,null,null,null,null,null,null,null,null,null,null,null,null,null,null,null,null,null,null,null,null,null,null,null,0.79000000000000048,7.4452728899493232,-2.6127876287600085,52.871814378090804,8.0000000000000284,58.483702039355634]
[null,null,null,null,null,null,null,null,null,null,null,null,null,null,null,null,null,null,null,null,null,null,null,null,null,null,null,null,null,0.80000000000000049,8.0000000000000284,-2.7569260366506909,58.483702039355634,8.614946930736437,65.006915629322691]
[null,null,null,null,null,null,null,null,null,null,null,null,null,null,null,null,null,null,null,null,null,null,null,null,null,null,null,null,null,0.8100000000000005,8.614946930736437,-2.9127665796524682,65.006915629322691,9.3001383125864834,72.650534354667172]
[null,null,null,null,null,null,null,null,null,null,null,null,null,null,null,null,null,null,null,null,null,null,null,null,null,null,null,null,null,0.82000000000000051,9.3001383125864834,-3.0818718757911912,72.650534354667172,10.067957617829782,81.68729924671122]
[null,null,null,null,null,null,null,null,null,null,null,null,null,null,null,null,null,null,null,null,null,null,null,null,null,null,null,null,null,0.83000000000000052,10.067957617829782,-3.2661077492469097,81.68729924671122,10.933884297520709,92.478407768307491]
[null,null,null,null,null,null,null,null,null,null,null,null,null,null,null,null,null,null,null,null,null,null,null,null,null,null,null,null,null,0.84000000000000052,10.933884297520709,-3.4677218234253822,92.478407768307491,11.917525773195933,105.51037066188655]
[null,null,null,null,null,null,null,null,null,null,null,null,null,null,null,null,null,null,null,null,null,null,null,null,null,null,null,null,null,0.85000000000000053,11.917525773195933,-3.6894480851113087,105.51037066188655,13.044091710758442,121.45114776415269]
[null,null,null,null,null,null,null,null,null,null,null,null,null,null,null,null,null,null,null,null,null,null,null,null,null,null,null,null,null,0.86000000000000054,13.044091710758442,-3.9346480060362121,121.45114776415269,14.346548728478989,141.23803741290206]
[null,null,null,null,null,null,null,null,null,null,null,null,null,null,null,null,null,null,null,null,null,null,null,null,null,null,null,null,null,0.87000000000000055,14.346548728478989,-4.2075039910442324,141.23803741290206,15.868852459016486,166.2196912949629]
[null,null,null,null,null,null,null,null,null,null,null,null,null,null,null,null,null,null,null,null,null,null,null,null,null,null,null,null,null,0.88000000000000056,15.868852459016486,-4.5132890713714211,166.2196912949629,17.67094255437825,198.39411174305991]
[null,null,null,null,null,null,null,null,null,null,null,null,null,null,null,null,null,null,null,null,null,null,null,null,null,null,null,null,null,0.89000000000000057,17.67094255437825,-4.8587497886039834,198.39411174305991,19.836734693877688,240.8249021521074]
[null,null,null,null,null,null,null,null,null,null,null,null,null,null,null,null,null,null,null,null,null,null,null,null,null,null,null,null,null,0.90000000000000058,19.836734693877688,-5.2526603089252744,240.8249021521074,22.487440597420402,298.40716774515073]
[null,null,null,null,null,null,null,null,null,null,null,null,null,null,null,null,null,null,null,null,null,null,null,null,null,null,null,null,null,0.91000000000000059,22.487440597420402,-5.7066400750218884,298.40716774515073,25.804878048780708,379.36601707190914]
[null,null,null,null,null,null,null,null,null,null,null,null,null,null,null,null,null,null,null,null,null,null,null,null,null,null,null,null,null,0.9200000000000006,25.804878048780708,-6.2363817452857075,379.36601707190914,30.074760938858592,498.4200651723209]
[null,null,null,null,null,null,null,null,null,null,null,null,null,null,null,null,null,null,null,null,null,null,null,null,null,null,null,null,null,0.9300000000000006,30.074760938858592,-6.8635142664180195,498.4200651723209,35.773279352227135,684.14074093588749]
[null,null,null,null,null,null,null,null,null,null,null,null,null,null,null,null,null,null,null,null,null,null,null,null,null,null,null,null,null,0.94000000000000061,35.773279352227135,-7.6183916071008948,684.14074093588749,43.757575757576355,998.43280658223762]
[null,null,null,null,null,null,null,null,null,null,null,null,null,null,null,null,null,null,null,null,null,null,null,null,null,null,null,null,null,0.95000000000000062,43.757575757576355,-8.5438684766289583,998.43280658223762,55.741935483871906,1598.4391195659346]
[null,null,null,null,null,null,null,null,null,null,null,null,null,null,null,null,null,null,null,null,null,null,null,null,null,null,null,null,null,0.96000000000000063,55.741935483871906,-9.6978101562461152,1598.4391195659346,75.726358148895073,2998.4453944812954]
[null,null,null,null,null,null,null,null,null,null,null,null,null,null,null,null,null,null,null,null,null,null,null,null,null,null,null,null,null,0.97000000000000064,75.726358148895073,-11.135184587849244,2998.4453944812954,115.71084337349787,7998.4516316341842]
[null,null,null,null,null,null,null,null,null,null,null,null,null,null,null,null,null,null,null,null,null,null,null,null,null,null,null,null,null,0.98000000000000065,115.71084337349787,-12.702549137117421,7998.4516316341842,235.69539078157891,29998.456596603522]
[null,null,null,null,null,null,null,null,null,null,null,null,null,null,null,null,null,null,null,null,null,null,null,null,null,null,null,null,null,0.99000000000000066,235.69539078157891,-11.134846283433964,29998.456596603522,595.68614891913467,239998.46061398205]
[null,null,null,null,null,null,null,null,null,null,null,null,null,null,null,null,null,null,null,null,null,null,null,null,null,null,null,null,null,{"$f":"MIN(IF($B$4=0,$F$5/$E$4,$C$5/$B$4),IF($E$4=0,$C$5/$B$4,$F$5/$E$4))-(MIN(IF($B$4=0,$F$5/$E$4,$C$5/$B$4),IF($E$4=0,$C$5/$B$4,$F$5/$E$4))+MIN(IF($H$4=0,$L$5/$K$4,$I$5/$H$4),IF($K$4=0,$I$5/$H$4,$L$5/$K$4)))/250","v":0.996},595.68614891913467,20.405659164945877,239998.46061398205,2395.6815363072596,599998.46246270777]
[null,null,null,null,null,null,null,null,null,null,null,null,null,null,null,null,null,null,null,null,null,null,null,null,null,null,null,null,null,{"$f":"MIN(IF($B$4=0,$F$5/$E$4,$C$5/$B$4),IF($E$4=0,$C$5/$B$4,$F$5/$E$4))-(MIN(IF($B$4=0,$F$5/$E$4,$C$5/$B$4),IF($E$4=0,$C$5/$B$4,$F$5/$E$4))+MIN(IF($H$4=0,$L$5/$K$4,$I$5/$H$4),IF($K$4=0,$I$5/$H$4,$L$5/$K$4)))/1000","v":0.999},2395.6815363072596,375.13133594291389,{"$f":"(AE116-AE115)/(AD116-AD115)","v":599998.46246270777},0,0]

{"sheet":"Notes","index":7,"n_rows":11,"n_cols":3,"rows_kept":11,"cut":false,"hidden":false,"merged":[]}
["¾",null,"EQUILIBRATOR"]
[]
[null,"1) Many calculations are located (and protected) off on the right of each spreadsheet. Be careful not to change or delete them."]
[null,"2) Each worksheet is protected, meaning end-users can only change the input cells. This can be turned off under Excel's Review tab with a password. The status of individual cells can be altered under the 'format cells' dialogue."]
[null,"3) Do not use 'smoothing' curves for graph as it often confuses the automatically generated y-axis limits."]
[null,"4) Additional worksheets can easily be developed by modifying existing ones. The only external value required is the K value, which is generated from from using literature values according to lnK = C1 + C2/T + C3lnT + C4T + C5T^2 + C6T^3. The JANAF database is a good place to find these coefficients."]
[null,"5) The free energy is calculated relative to the state of maximum reactants (minimum reaction coordinate)."]
[null,"6) The slider divides the reaction coordinate into 10,000 steps, but the first and the last are inaccessible to prevent division by zero."]
[null,"7) To permanently enable the macros in this program, go to 'Excel Options' under the 'Office Button' in the upper lefthand corner. Change the trust center settings to enable digitally signed macros."]
[]
["Developed by Prof. Douglas A. Vander Griend, Calvin College, Grand Rapids, MI"]